{"text_format":"1","workbook":"xlsx","n_sheets":20,"sheets":["Pagas (Portal)","Guia 2","Guia 3","Guia 4","Guia 5","Guia 6","Guia 7","Guia 8","Guia 9","Guia 10","Guia 11","Guia 12","Guia 13","Guia 14","Guia 15","Guia 16","Guia 17","Guia 18","Guia 19","Guia 20"],"not_rendered":{"charts":0,"images":0,"macros":1,"external_links":0,"defined_names":296,"comments":0,"pivot_tables":0},"unopened":[],"bounds":{"document_bytes":16777216,"sheet_cells":100000,"rows_first":2000,"rows_last":500,"rows_between":2000,"halvings":0,"cell_chars":16384,"cell_head_chars":4096},"cells_cut":0,"cells_raw":0,"read":"whole","date_system":"1900"}

{"sheet":"Pagas (Portal)","index":0,"n_rows":512,"n_cols":46,"rows_kept":512,"cut":false,"hidden":false,"merged":[[7,12,8,12],[7,13,8,13],[6,14,8,14],[7,21,8,21],[7,22,8,22],[6,15,6,22],[7,29,7,31],[7,32,7,34],[7,35,7,40],[7,15,8,15],[7,16,8,16],[7,17,8,17],[7,18,8,18],[7,19,8,19],[6,35,6,45],[7,2,8,2],[7,3,8,3],[7,4,8,4],[7,5,8,5],[7,6,8,6],[6,10,6,11],[7,20,8,20],[7,7,8,7],[7,8,8,8],[7,9,8,9],[7,10,8,10],[7,11,8,11],[7,41,7,43],[7,44,7,45],[7,23,7,28],[4,2,4,8],[5,4,5,7],[6,2,6,5],[6,6,6,9],[6,23,6,34]]}
[]
[null,null,"Superior Tribunal de Justiça"]
[null,null,"Secretaria de Processamento de Feitos"]
[null,null,"Coordenadoria de Processamento de Feitos em Execução Judicial"]
[null,null,{"$f":"\"Relação das Requisições de Pequeno Valor - RPV pagas pelo STJ em \"&IF(F11=\"\",\"\",UPPER((TEXT(F11,\"mmmm/aaaa\"))))","v":"Relação das Requisições de Pequeno Valor - RPV pagas pelo STJ em SETEMBRO/2025"}]
[]
[null,null,"RPV",null,null,null,"P R O C E S S O     D E     O R I G E M",null,null,null,"E N T I D A D E S",null,"R E Q U E R E N T E","A D V O G A D O","Natureza do crédito","I N D I C A D O R E S",null,null,null,null,null,null,null,"VALORES REQUISITADOS",null,null,null,null,null,null,null,null,null,null,null,"VALORES ATUALIZADOS PARA PAGAMENTO"]
[null,null,"Nº","Registro","Autuada em","data do pgto","Ação","Autuada em","Tipo de causa","Trânsito","Entidade devedora","Órgão de origem","Origem do crédito","Origem do crédito",null,"Tributário","EC 94 2016","Lei 13.463 2017","PRC/RPV de origem","Nº DA GRU","DOENÇA GRAVE","Deficiência física","Isento de IR","Beneficiários",null,null,null,null,null,"PSSS",null,null,"R R A",null,null,"Beneficiários",null,null,null,null,null,"P S S S",null,null,"R R A"]
[null,null,null,null,null,null,null,null,null,null,null,null,null,null,null,null,null,null,null,null,null,null,null,"Total","Adv I","Adv II","Adv III","Adv IV","Requerente","Base","Desc","Patronal","NMA","Exercícios anteriores","Desconto","Total","Adv I","Adv II","Adv III","Adv IV","Reqte","BASE desc","Desc","Patronal","Exercícios anteriores","Dedução"]
[]
[null,{"$f":"IF(C11=\"\",\"\",1)","v":1},19395,"0477987-53.2024.3.00.0000","2024-12-13","2025-09-01","AR 1.169/CE","1999-10-18","Administrativo - Servidor Público Civil - Sistema Remuneratório e Benefícios","2004-06-07","Instituto Nacional do Seguro Social – INSS","Instituto Nacional do Seguro Social - INSS","Anuênios","Dedução de Honorários Contratuais","Alimentar","Não","Não","Não","-","-","Não informada","Não Informada","NÃO",10684.52,1068.45,0,0,0,9616.07,4318.84,475.07,950.14,111,3250.39,475.07,11450.87,1145.08,0,0,0,10305.790000000001,4628.6099999999997,509.14,1018.28,3483.53,509.14]
[null,{"$f":"IF(C12=\"\",\"\",B11+1)","v":2},19397,"0477990-08.2024.3.00.0000","2024-12-13","2025-09-01","AR 1.169/CE","1999-10-18","Administrativo - Servidor Público Civil - Sistema Remuneratório e Benefícios","2004-06-07","Instituto Nacional do Seguro Social – INSS","Instituto Nacional do Seguro Social - INSS","Anuênios","Dedução de Honorários Contratuais","Alimentar","Não","Não","Não","-","-","Não informada","Não Informada","NÃO",5620.44,562.04,0,0,0,5058.3999999999996,1979.82,217.78,435.56,111,1709.84,217.78,6023.57,602.35,0,0,0,5421.22,2170.4699999999998,238.75,477.5,1832.48,238.75]
[null,{"$f":"IF(C13=\"\",\"\",B12+1)","v":3},19400,"0478038-64.2024.3.00.0000","2024-12-13","2025-09-01","AR 1.169/CE","1999-10-18","Administrativo - Servidor Público Civil - Sistema Remuneratório e Benefícios","2004-06-07","Instituto Nacional do Seguro Social – INSS","Instituto Nacional do Seguro Social - INSS","Anuênios","Dedução de Honorários Contratuais","Alimentar","Não","Não","Não","-","-","Não informada","Não Informada","NÃO",15297.94,3059.58,0,0,0,12238.36,6183.42,680.17,1360.34,116,3123.84,680.17,16395.2,3279.04,0,0,0,13116.16,6626.93,728.96,1457.92,3347.89,728.96]
[null,4,19456,"0478791-21.2024.3.00.0000","2024-12-13","2025-09-01","AR 1.169/CE","1999-10-18","Administrativo - Servidor Público Civil - Sistema Remuneratório e Benefícios","2004-06-07","Instituto Nacional do Seguro Social – INSS","Instituto Nacional do Seguro Social - INSS","Anuênios","Dedução de Honorários Contratuais","Alimentar","Não","Não","Não","-","-","Não informada","Não Informada","NÃO",3242.33,324.23,0,0,0,2918.1,1396.85,153.65,307.3,47,1072.6199999999999,153.65,3474.89,347.48,0,0,0,3127.41,1497.04,164.67,329.34,1149.56,164.67]
[null,5,19565,"0039608-74.2025.3.00.0000","2025-02-10","2025-09-01","MS 15.369/DF","2010-06-28","Administrativo - Militar - Regime - Anistia Política (PRINCIPAL)","2018-05-10","União","-","Honorários de sucumbência","x.x.x","Alimentar","Não","Não","Não","-","-","Não informada","Não Informada","NÃO",24232.5,0,0,0,0,24232.5,0,0,0,0,0,0,26095.97,0,0,0,0,26095.97,0,0,0,0,0]
[null,6,19662,"0057015-93.2025.3.00.0000","2025-02-20","2025-09-01","MS 20.231/DF","2013-06-06","Administrativo - Servidor Público Civil - Sistema Remuneratório e Benefícios (PRINCIPAL)","2017-04-29","União","Ministério do Planejamento, Orçamento e Gestão","Gratificação de Apoio à Execução de Atividades da Comissão Executiva do Plano da Lavoura Cacaueira - GECEPLAC","Dedução de Honorários Contratuais","Alimentar","Não","Não","Não","-","-","Não informada","Não Informada","NÃO",10107.9,1010.79,0,0,0,9097.11,7141.89,785.6,0,65,6131.1,785.6,10678.59,1067.8499999999999,0,0,0,9610.74,7545.12,829.96,0,6477.27,829.96]
[null,7,19681,"0059816-79.2025.3.00.0000","2025-02-21","2025-09-01","MS 3.099/DF","1993-09-15","Administrativo - Servidor Público Civil - Reajustes de Remuneração, Proventos ou Pensão - Índice de 28,86% Lei 8.622/1993 e 8.627/1993","2000-06-07","União","Ministério da Saúde","Índice de 28,86% Lei 8.622/1993 e 8.627/1993","Dedução de Honorários Contratuais","Alimentar","Não","Não","Não","-","-","Não informada","Não Informada","NÃO",2472.54,247.25,0,0,0,2225.29,819.35,90.12,180.24,63,572.1,90.12,2612.14,261.20999999999998,0,0,0,2350.9299999999998,865.61,95.21,190.42,604.4,95.21]
[null,8,19710,"0061403-39.2025.3.00.0000","2025-02-24","2025-09-01","MS 6.019/DF","1998-10-22","Administrativo - Servidor Público Civil - Sistema Remuneratório e Benefícios","2007-12-10","Instituto Nacional do Seguro Social – INSS","Instituto Nacional do Seguro Social - INSS","Reajuste Salarial - Resíduo de 3,17%","Dedução de Honorários Contratuais","Alimentar","Não","Não","Não","-","-","Não informada","Não Informada","NÃO",54589.7,3548.33,0,0,0,51041.37,0,0,0,43,21153.32,0,57671.89,3748.67,0,0,0,53923.22,0,0,0,22347.66,0]
[null,9,19721,"0063544-31.2025.3.00.0000","2025-02-25","2025-09-01","MS 6.019/DF","1998-10-22","Administrativo - Servidor Público Civil - Sistema Remuneratório e Benefícios","2007-12-10","Instituto Nacional do Seguro Social – INSS","Instituto Nacional do Seguro Social - INSS","Reajuste Salarial - Resíduo de 3,17%","Dedução de Honorários Contratuais","Alimentar","Não","Não","Não","-","-","Não informada","Não Informada","NÃO",36366.19,2363.8000000000002,0,0,0,34002.39,0,0,0,43,13858.52,0,38419.449999999997,2497.2600000000002,0,0,0,35922.19,0,0,0,14640.98,0]
[null,10,19736,"0063817-10.2025.3.00.0000","2025-02-25","2025-09-01","MS 6.019/DF","1998-10-22","Administrativo - Servidor Público Civil - Sistema Remuneratório e Benefícios","2007-12-10","Instituto Nacional do Seguro Social – INSS","Instituto Nacional do Seguro Social - INSS","Reajuste Salarial - Resíduo de 3,17%","Dedução de Honorários Contratuais","Alimentar","Não","Não","Não","-","-","Não informada","Não Informada","NÃO",36065.480000000003,2344.25,0,0,0,33721.230000000003,0,0,0,43,13742.09,0,38113.339999999997,2477.36,0,0,0,35635.980000000003,0,0,0,14522.39,0]
[null,11,19739,"0063844-90.2025.3.00.0000","2025-02-25","2025-09-01","MS 6.019/DF","1998-10-22","Administrativo - Servidor Público Civil - Sistema Remuneratório e Benefícios","2007-12-10","Instituto Nacional do Seguro Social – INSS","Instituto Nacional do Seguro Social - INSS","Reajuste Salarial - Resíduo de 3,17%","Dedução de Honorários Contratuais","Alimentar","Não","Não","Não","-","-","Não informada","Não Informada","NÃO",30196.78,1962.79,0,0,0,28233.99,0,0,0,43,11515.08,0,31911.41,2074.2399999999998,0,0,0,29837.17,0,0,0,12168.93,0]
[null,12,19776,"0068519-96.2025.3.00.0000","2025-02-27","2025-09-01","MS 10.438/DF","2005-02-22","Administrativo - Militar - Pensão","2007-09-13","União","Ministério da Fazenda","Soldo previsto na Lei Estadual 1.063/2002","Dedução de Honorários Contratuais","Alimentar","Não","Não","Não","-","-","Não informada","Não Informada","NÃO",86964.82,17827.78,9131.2999999999993,0,0,60005.74,0,0,0,18,41248.089999999997,0,91874.94,18834.36,9646.86,0,0,63393.72,0,0,0,43577,0]
[null,13,19793,"0068748-56.2025.3.00.0000","2025-02-27","2025-09-01","MS 6.019/DF","1998-10-22","Administrativo - Servidor Público Civil - Sistema Remuneratório e Benefícios","2007-12-10","Instituto Nacional do Seguro Social – INSS","Instituto Nacional do Seguro Social - INSS","Reajuste Salarial - Resíduo de 3,17%","Dedução de Honorários Contratuais","Alimentar","Não","Não","Não","-","-","Não informada","Não Informada","NÃO",31056.95,2018.7,0,0,0,29038.25,0,0,0,43,11957.93,0,32810.449999999997,2132.67,0,0,0,30677.78,0,0,0,12633.09,0]
[null,14,19876,"0097489-09.2025.3.00.0000","2025-03-20","2025-09-01","MS 21.601/DF","2015-02-20","Administrativo - Servidor Público Civil - Sistema Remuneratório e Benefícios (PRINCIPAL)","2017-06-27","União","Ministério do Planejamento, Orçamento e Gestão","Incorporação de gratificação de apoio - GCEPLAC - Lei 12.702/12","Dedução de Honorários Contratuais","Alimentar","Não","Não","Não","-","-","Não informada","Não Informada","NÃO",26078.27,2607.8200000000002,1303.9100000000001,0,0,22166.54,21702.15,2387.23,0,73,17790.419999999998,2387.23,27351.85,2735.18,1367.59,0,0,23249.08,22762.02,2503.8200000000002,0,18659.25,2503.8200000000002]
[null,15,19877,"0097492-61.2025.3.00.0000","2025-03-20","2025-09-01","MS 21.601/DF","2015-02-20","Administrativo - Servidor Público Civil - Sistema Remuneratório e Benefícios (PRINCIPAL)","2017-06-27","União","Ministério do Planejamento, Orçamento e Gestão","Incorporação de gratificação de apoio - GCEPLAC - Lei 12.702/12","Dedução de Honorários Contratuais","Alimentar","Não","Não","Não","-","-","Não informada","Não Informada","NÃO",16395.650000000001,1639.56,819.78,0,0,13936.31,13146.06,1446.06,0,65,10686.72,1446.06,17196.36,1719.63,859.81,0,0,14616.92,13788.07,1516.68,0,11208.63,1516.68]
[null,16,19878,"0097500-38.2025.3.00.0000","2025-03-20","2025-09-01","MS 21.601/DF","2015-02-20","Administrativo - Servidor Público Civil - Sistema Remuneratório e Benefícios (PRINCIPAL)","2017-06-27","União","Ministério do Planejamento, Orçamento e Gestão","Incorporação de gratificação de apoio - GCEPLAC - Lei 12.702/12","Dedução de Honorários Contratuais","Alimentar","Não","Não","Não","-","-","Não informada","Não Informada","NÃO",6931.78,693.17,346.58,0,0,5892.03,5554.08,610.94000000000005,0,65,4514.33,610.94000000000005,7270.3,727.03,363.51,0,0,6179.76,5825.32,640.78,0,4734.78,640.78]
[null,17,19879,"0097548-94.2025.3.00.0000","2025-03-20","2025-09-01","MS 21.601/DF","2015-02-20","Administrativo - Servidor Público Civil - Sistema Remuneratório e Benefícios (PRINCIPAL)","2017-06-27","União","Ministério do Planejamento, Orçamento e Gestão","Incorporação de gratificação de apoio - GCEPLAC - Lei 12.702/12","Dedução de Honorários Contratuais","Alimentar","Não","Não","Não","-","-","Não informada","Não Informada","NÃO",5921.91,592.19000000000005,296.08999999999997,0,0,5033.63,4747.38,522.21,0,65,3859.1,522.21,6211.11,621.11,310.55,0,0,5279.45,4979.22,547.71,0,4047.56,547.71]
[null,18,19880,"0097550-64.2025.3.00.0000","2025-03-20","2025-09-01","MS 21.601/DF","2015-02-20","Administrativo - Servidor Público Civil - Sistema Remuneratório e Benefícios (PRINCIPAL)","2017-06-27","União","Ministério do Planejamento, Orçamento e Gestão","Incorporação de gratificação de apoio - GCEPLAC - Lei 12.702/12","Dedução de Honorários Contratuais","Alimentar","Não","Não","Não","-","-","Não informada","Não Informada","NÃO",16395.650000000001,1639.56,819.78,0,0,13936.31,13146.06,1446.06,0,65,10686.72,1446.06,17196.36,1719.63,859.81,0,0,14616.92,13788.07,1516.68,0,11208.63,1516.68]
[null,19,19881,"0097551-49.2025.3.00.0000","2025-03-20","2025-09-01","MS 21.601/DF","2015-02-20","Administrativo - Servidor Público Civil - Sistema Remuneratório e Benefícios (PRINCIPAL)","2017-06-27","União","Ministério do Planejamento, Orçamento e Gestão","Incorporação de gratificação de apoio - GCEPLAC - Lei 12.702/12","Dedução de Honorários Contratuais","Alimentar","Não","Não","Não","-","-","Não informada","Não Informada","NÃO",16395.650000000001,1639.56,819.78,0,0,13936.31,13146.06,1446.06,0,65,10686.72,1446.06,17196.36,1719.63,859.81,0,0,14616.92,13788.07,1516.68,0,11208.63,1516.68]
[null,20,19882,"0097554-04.2025.3.00.0000","2025-03-20","2025-09-01","MS 21.601/DF","2015-02-20","Administrativo - Servidor Público Civil - Sistema Remuneratório e Benefícios (PRINCIPAL)","2017-06-27","União","Ministério do Planejamento, Orçamento e Gestão","Incorporação de gratificação de apoio - GCEPLAC - Lei 12.702/12","Dedução de Honorários Contratuais","Alimentar","Não","Não","Não","-","-","Não informada","Não Informada","NÃO",30238.51,3023.85,1511.92,0,0,25702.74,25170.59,2768.76,0,73,20634.82,2768.76,31715.27,3171.52,1585.76,0,0,26957.99,26399.85,2903.98,0,21642.57,2903.98]
[null,21,19883,"0097587-91.2025.3.00.0000","2025-03-20","2025-09-01","MS 21.601/DF","2015-02-20","Administrativo - Servidor Público Civil - Sistema Remuneratório e Benefícios (PRINCIPAL)","2017-06-27","União","Ministério do Planejamento, Orçamento e Gestão","Incorporação de gratificação de apoio - GCEPLAC - Lei 12.702/12","Dedução de Honorários Contratuais","Alimentar","Não","Não","Não","-","-","Não informada","Não Informada","NÃO",30238.49,3023.84,1511.92,0,0,25702.73,25170.59,2768.76,0,73,20634.830000000002,2768.76,31715.25,3171.52,1585.76,0,0,26957.97,26399.85,2903.98,0,21642.57,2903.98]
[null,22,19885,"0097596-53.2025.3.00.0000","2025-03-20","2025-09-01","MS 21.601/DF","2015-02-20","Administrativo - Servidor Público Civil - Sistema Remuneratório e Benefícios (PRINCIPAL)","2017-06-27","União","Ministério do Planejamento, Orçamento e Gestão","Incorporação de gratificação de apoio - GCEPLAC - Lei 12.702/12","Dedução de Honorários Contratuais","Alimentar","Não","Não","Não","-","-","Não informada","Não Informada","NÃO",30238.51,3023.85,1511.92,0,0,25702.74,25170.59,2768.76,0,73,20634.82,2768.76,31715.27,3171.52,1585.76,0,0,26957.99,26399.85,2903.98,0,21642.57,2903.98]
[null,23,19886,"0097600-90.2025.3.00.0000","2025-03-20","2025-09-01","MS 21.601/DF","2015-02-20","Administrativo - Servidor Público Civil - Sistema Remuneratório e Benefícios (PRINCIPAL)","2017-06-27","União","Ministério do Planejamento, Orçamento e Gestão","Incorporação de gratificação de apoio - GCEPLAC - Lei 12.702/12","Dedução de Honorários Contratuais","Alimentar","Não","Não","Não","-","-","Não informada","Não Informada","NÃO",5921.91,592.19000000000005,296.08999999999997,0,0,5033.63,4747.38,522.21,0,65,3859.1,522.21,6211.11,621.11,310.55,0,0,5279.45,4979.22,547.71,0,4047.56,547.71]
[null,24,19887,"0097601-75.2025.3.00.0000","2025-03-20","2025-09-01","MS 21.601/DF","2015-02-20","Administrativo - Servidor Público Civil - Sistema Remuneratório e Benefícios (PRINCIPAL)","2017-06-27","União","Ministério do Planejamento, Orçamento e Gestão","Incorporação de gratificação de apoio - GCEPLAC - Lei 12.702/12","Dedução de Honorários Contratuais","Alimentar","Não","Não","Não","-","-","Não informada","Não Informada","NÃO",10926.87,1092.68,546.34,0,0,9287.85,9094.91,1000.44,0,73,7455.89,1000.44,11460.5,1146.05,573.02,0,0,9741.43,9539.08,1049.29,0,7820.01,1049.29]
[null,25,19888,"0097623-36.2025.3.00.0000","2025-03-20","2025-09-01","MS 21.601/DF","2015-02-20","Administrativo - Servidor Público Civil - Sistema Remuneratório e Benefícios (PRINCIPAL)","2017-06-27","União","Ministério do Planejamento, Orçamento e Gestão","Incorporação de gratificação de apoio - GCEPLAC - Lei 12.702/12","Dedução de Honorários Contratuais","Alimentar","Não","Não","Não","-","-","Não informada","Não Informada","NÃO",8932.2000000000007,893.22,446.61,0,0,7592.37,7213.27,793.45,0,37,5873.44,793.45,9368.41,936.84,468.42,0,0,7963.15,7565.54,832.2,0,6160.28,832.2]
[null,26,19889,"0097626-88.2025.3.00.0000","2025-03-20","2025-09-01","MS 21.601/DF","2015-02-20","Administrativo - Servidor Público Civil - Sistema Remuneratório e Benefícios (PRINCIPAL)","2017-06-27","União","Ministério do Planejamento, Orçamento e Gestão","Incorporação de gratificação de apoio - GCEPLAC - Lei 12.702/12","Dedução de Honorários Contratuais","Alimentar","Não","Não","Não","-","-","Não informada","Não Informada","NÃO",16395.650000000001,1639.56,819.78,0,0,13936.31,13146.06,1446.06,0,65,10686.72,1446.06,17196.36,1719.63,859.81,0,0,14616.92,13788.07,1516.68,0,11208.63,1516.68]
[null,27,19890,"0097629-43.2025.3.00.0000","2025-03-20","2025-09-01","MS 21.601/DF","2015-02-20","Administrativo - Servidor Público Civil - Sistema Remuneratório e Benefícios (PRINCIPAL)","2017-06-27","União","Ministério do Planejamento, Orçamento e Gestão","Incorporação de gratificação de apoio - GCEPLAC - Lei 12.702/12","Dedução de Honorários Contratuais","Alimentar","Não","Não","Não","-","-","Não informada","Não Informada","NÃO",30238.51,3023.85,1511.92,0,0,25702.74,25170.59,2768.76,0,73,20634.82,2768.76,31715.27,3171.52,1585.76,0,0,26957.99,26399.85,2903.98,0,21642.57,2903.98]
[null,28,19998,"0108703-94.2025.3.00.0000","2025-03-27","2025-09-01","AR 1.169/CE","1999-10-18","Administrativo - Servidor Público Civil - Sistema Remuneratório e Benefícios","2004-06-07","Instituto Nacional do Seguro Social – INSS","Instituto Nacional do Seguro Social - INSS","Anuênios","Dedução de Honorários Contratuais","Alimentar","Não","Não","Não","-","-","Não informada","Não Informada","NÃO",23837.759999999998,2383.77,0,0,0,21453.99,8886.92,977.56,1955.12,47,6503.15,977.56,25001.919999999998,2500.19,0,0,0,22501.73,9320.93,1025.3,2050.6,6820.74,1025.3]
[null,29,20126,"0151584-86.2025.3.00.0000","2025-04-29","2025-09-01","MS 6.040/DF","1998-11-16","Administrativo - Servidor Público Civil - Sistema Remuneratório e Benefícios (PRINCIPAL)","2003-10-01","União","Superintendência de Seguros Privados - SUSEP","Incorporação da diferença de 3,17%","Dedução de Honorários Contratuais","Alimentar","Não","Não","Não","-","-","Não informada","Não Informada","NÃO",10775.64,538.78,538.78,0,0,9698.08,9224.08,1014.64,2029.28,42,3414.8,1014.64,11223.35,561.16,561.16,0,0,10101.030000000001,9753.5400000000009,1072.8800000000001,2145.7600000000002,3556.69,1072.8800000000001]
[null,30,20127,"0151610-84.2025.3.00.0000","2025-04-29","2025-09-01","MS 6.040/DF","1998-11-16","Administrativo - Servidor Público Civil - Sistema Remuneratório e Benefícios (PRINCIPAL)","2003-10-01","União","Superintendência de Seguros Privados - SUSEP","Incorporação da diferença de 3,17%","Dedução de Honorários Contratuais","Alimentar","Não","Não","Não","-","-","Não informada","Não Informada","NÃO",8978.65,448.93,448.93,0,0,8080.79,9378.7199999999993,1031.6500000000001,2063.3000000000002,42,2639.25,1031.6500000000001,9351.7000000000007,467.58,467.58,0,0,8416.5400000000009,9917.0499999999993,1090.8699999999999,2181.7399999999998,2748.91,1090.8699999999999]
[null,31,20128,"0151615-09.2025.3.00.0000","2025-04-29","2025-09-01","MS 6.040/DF","1998-11-16","Administrativo - Servidor Público Civil - Sistema Remuneratório e Benefícios (PRINCIPAL)","2003-10-01","União","Superintendência de Seguros Privados - SUSEP","Incorporação da diferença de 3,17%","Dedução de Honorários Contratuais","Alimentar","Não","Não","Não","-","-","Não informada","Não Informada","NÃO",3434.63,171.73,171.73,0,0,3091.17,0,0,0,42,685.82,0,3577.33,178.86,178.86,0,0,3219.61,0,0,0,714.32,0]
[null,32,20129,"0151619-46.2025.3.00.0000","2025-04-29","2025-09-01","MS 6.040/DF","1998-11-16","Administrativo - Servidor Público Civil - Sistema Remuneratório e Benefícios (PRINCIPAL)","2003-10-01","União","Superintendência de Seguros Privados - SUSEP","Incorporação da diferença de 3,17%","Dedução de Honorários Contratuais","Alimentar","Não","Não","Não","-","-","Não informada","Não Informada","NÃO",8863.0300000000007,443.15,443.15,0,0,7976.73,9407.07,1034.77,2069.54,42,2588.2800000000002,1034.77,9231.27,461.56,461.56,0,0,8308.15,9947.0300000000007,1094.17,2188.34,2695.82,1094.17]
[null,33,20130,"0151620-31.2025.3.00.0000","2025-04-29","2025-09-01","MS 6.040/DF","1998-11-16","Administrativo - Servidor Público Civil - Sistema Remuneratório e Benefícios (PRINCIPAL)","2003-10-01","União","Superintendência de Seguros Privados - SUSEP","Incorporação da diferença de 3,17%","Dedução de Honorários Contratuais","Alimentar","Não","Não","Não","-","-","Não informada","Não Informada","NÃO",6163.25,308.16000000000003,308.16000000000003,0,0,5546.93,7622.6,838.48,1676.96,42,1577.86,838.48,6419.32,320.95999999999998,320.95999999999998,0,0,5777.4,8060.13,886.61,1773.22,1643.42,886.61]
[null,34,20131,"0151622-98.2025.3.00.0000","2025-04-29","2025-09-01","MS 6.040/DF","1998-11-16","Administrativo - Servidor Público Civil - Sistema Remuneratório e Benefícios (PRINCIPAL)","2003-10-01","União","Superintendência de Seguros Privados - SUSEP","Incorporação da diferença de 3,17%","Dedução de Honorários Contratuais","Alimentar","Não","Não","Não","-","-","Não informada","Não Informada","NÃO",32167.35,1608.36,1608.36,0,0,28950.63,27091.02,2980.01,5960.02,42,10437.68,2980.01,33503.86,1675.19,1675.19,0,0,30153.48,28646.04,3151.06,6302.12,10871.34,3151.06]
[null,35,20132,"0151624-68.2025.3.00.0000","2025-04-29","2025-09-01","MS 6.040/DF","1998-11-16","Administrativo - Servidor Público Civil - Sistema Remuneratório e Benefícios (PRINCIPAL)","2003-10-01","União","Superintendência de Seguros Privados - SUSEP","Incorporação da diferença de 3,17%","Dedução de Honorários Contratuais","Alimentar","Não","Não","Não","-","-","Não informada","Não Informada","NÃO",7543.45,377.17,377.17,0,0,6789.11,10034.27,1103.76,2207.52,42,1843.5,1103.76,7856.86,392.84,392.84,0,0,7071.18,10610.23,1167.1199999999999,2334.2399999999998,1920.09,1167.1199999999999]
[null,36,20133,"0151627-23.2025.3.00.0000","2025-04-29","2025-09-01","MS 6.040/DF","1998-11-16","Administrativo - Servidor Público Civil - Sistema Remuneratório e Benefícios (PRINCIPAL)","2003-10-01","União","Superintendência de Seguros Privados - SUSEP","Incorporação da diferença de 3,17%","Dedução de Honorários Contratuais","Alimentar","Não","Não","Não","-","-","Não informada","Não Informada","NÃO",7354.34,367.71,367.71,0,0,6618.92,9413.0499999999993,1035.43,2070.86,42,1800.97,1035.43,7659.9,382.99,382.99,0,0,6893.92,9953.35,1094.8599999999999,2189.7199999999998,1875.79,1094.8599999999999]
[null,37,20144,"0171862-11.2025.3.00.0000","2025-05-14","2025-09-01","MS 6.040/DF","1998-11-16","Administrativo - Servidor Público Civil - Sistema Remuneratório e Benefícios (PRINCIPAL)","2003-10-01","União","Superintendência de Seguros Privados - SUSEP","Incorporação da diferença de 3,17%","Dedução de Honorários Contratuais","Alimentar","Não","Não","Não","-","-","Não informada","Não Informada","NÃO",5127.66,256.38,256.38,0,0,4614.8999999999996,6888.22,757.7,1515.4,42,1247.32,757.7,5300.04,265,265,0,0,4770.04,7210.58,793.16,1586.32,1289.25,793.16]
[null,38,20145,"0171875-10.2025.3.00.0000","2025-05-14","2025-09-01","MS 6.040/DF","1998-11-16","Administrativo - Servidor Público Civil - Sistema Remuneratório e Benefícios (PRINCIPAL)","2003-10-01","União","Superintendência de Seguros Privados - SUSEP","Incorporação da diferença de 3,17%","Dedução de Honorários Contratuais","Alimentar","Não","Não","Não","-","-","Não informada","Não Informada","NÃO",28937.94,1446.89,1446.89,0,0,26044.16,27367.9,3010.46,6020.92,42,8680.89,3010.46,29910.78,1495.53,1495.53,0,0,26919.72,28648.71,3151.35,6302.7,8972.73,3151.35]
[null,39,20146,"0171877-77.2025.3.00.0000","2025-05-14","2025-09-01","MS 6.040/DF","1998-11-16","Administrativo - Servidor Público Civil - Sistema Remuneratório e Benefícios (PRINCIPAL)","2003-10-01","União","Superintendência de Seguros Privados - SUSEP","Incorporação da diferença de 3,17%","Dedução de Honorários Contratuais","Alimentar","Não","Não","Não","-","-","Não informada","Não Informada","NÃO",3997.93,199.89,199.89,0,0,3598.15,4907.38,539.80999999999995,1079.6199999999999,42,1026.97,539.80999999999995,4132.32,206.61,206.61,0,0,3719.1,5137.04,565.07000000000005,1130.1400000000001,1061.49,565.07000000000005]
[null,40,20147,"0171881-17.2025.3.00.0000","2025-05-14","2025-09-01","MS 6.040/DF","1998-11-16","Administrativo - Servidor Público Civil - Sistema Remuneratório e Benefícios (PRINCIPAL)","2003-10-01","União","Superintendência de Seguros Privados - SUSEP","Incorporação da diferença de 3,17%","Dedução de Honorários Contratuais","Alimentar","Não","Não","Não","-","-","Não informada","Não Informada","NÃO",3900.68,195.03,195.03,0,0,3510.62,0,0,0,42,754.53,0,4031.8,201.59,201.59,0,0,3628.62,0,0,0,779.88,0]
[null,41,20148,"0171906-30.2025.3.00.0000","2025-05-14","2025-09-01","MS 6.040/DF","1998-11-16","Administrativo - Servidor Público Civil - Sistema Remuneratório e Benefícios (PRINCIPAL)","2003-10-01","União","Superintendência de Seguros Privados - SUSEP","Incorporação da diferença de 3,17%","Dedução de Honorários Contratuais","Alimentar","Não","Não","Não","-","-","Não informada","Não Informada","NÃO",17843.78,892.18,892.18,0,0,16059.42,17116.88,1882.85,3765.7,42,5424.5,1882.85,18443.64,922.18,922.18,0,0,16599.28,17917.939999999999,1970.97,3941.94,5606.84,1970.97]
[null,42,20149,"0171917-59.2025.3.00.0000","2025-05-14","2025-09-01","MS 6.040/DF","1998-11-16","Administrativo - Servidor Público Civil - Sistema Remuneratório e Benefícios (PRINCIPAL)","2003-10-01","União","Superintendência de Seguros Privados - SUSEP","Incorporação da diferença de 3,17%","Dedução de Honorários Contratuais","Alimentar","Não","Não","Não","-","-","Não informada","Não Informada","NÃO",17780.189999999999,889,889,0,0,16002.19,0,0,0,42,5377.1,0,18377.919999999998,918.89,918.89,0,0,16540.14,0,0,0,5557.86,0]
[null,43,20150,"0171920-14.2025.3.00.0000","2025-05-14","2025-09-01","MS 6.040/DF","1998-11-16","Administrativo - Servidor Público Civil - Sistema Remuneratório e Benefícios (PRINCIPAL)","2003-10-01","União","Superintendência de Seguros Privados - SUSEP","Incorporação da diferença de 3,17%","Dedução de Honorários Contratuais","Alimentar","Não","Não","Não","-","-","Não informada","Não Informada","NÃO",33312.04,1665.6,1665.6,0,0,29980.84,27555.47,3031.1,6062.2,42,10549.69,3031.1,34431.93,1721.59,1721.59,0,0,30988.75,28845.06,3172.95,6345.9,10904.36,3172.95]
[null,44,20151,"0171927-06.2025.3.00.0000","2025-05-14","2025-09-01","MS 6.040/DF","1998-11-16","Administrativo - Servidor Público Civil - Sistema Remuneratório e Benefícios (PRINCIPAL)","2003-10-01","União","Superintendência de Seguros Privados - SUSEP","Incorporação da diferença de 3,17%","Dedução de Honorários Contratuais","Alimentar","Não","Não","Não","-","-","Não informada","Não Informada","NÃO",6603.82,330.19,330.19,0,0,5943.44,8939.81,983.37,1966.74,42,1575.2,983.37,6825.82,341.29,341.29,0,0,6143.24,9358.19,1029.4000000000001,2058.8000000000002,1628.15,1029.4000000000001]
[null,45,20152,"0171932-28.2025.3.00.0000","2025-05-14","2025-09-01","MS 6.040/DF","1998-11-16","Administrativo - Servidor Público Civil - Sistema Remuneratório e Benefícios (PRINCIPAL)","2003-10-01","União","Superintendência de Seguros Privados - SUSEP","Incorporação da diferença de 3,17%","Dedução de Honorários Contratuais","Alimentar","Não","Não","Não","-","-","Não informada","Não Informada","NÃO",16959.72,847.98,847.98,0,0,15263.76,17311.330000000002,1904.24,3808.48,42,5050.32,1904.24,17529.86,876.49,876.49,0,0,15776.88,18121.5,1993.36,3986.72,5220.09,1993.36]
[null,46,20153,"0171939-20.2025.3.00.0000","2025-05-14","2025-09-01","MS 6.040/DF","1998-11-16","Administrativo - Servidor Público Civil - Sistema Remuneratório e Benefícios (PRINCIPAL)","2003-10-01","União","Superintendência de Seguros Privados - SUSEP","Incorporação da diferença de 3,17%","Dedução de Honorários Contratuais","Alimentar","Não","Não","Não","-","-","Não informada","Não Informada","NÃO",15943.57,797.17,797.17,0,0,14349.23,0,0,0,42,5052.8900000000003,0,16479.55,823.97,823.97,0,0,14831.61,0,0,0,5222.75,0]
[null,47,20154,"0171951-34.2025.3.00.0000","2025-05-14","2025-09-01","MS 6.040/DF","1998-11-16","Administrativo - Servidor Público Civil - Sistema Remuneratório e Benefícios (PRINCIPAL)","2003-10-01","União","Superintendência de Seguros Privados - SUSEP","Incorporação da diferença de 3,17%","Dedução de Honorários Contratuais","Alimentar","Não","Não","Não","-","-","Não informada","Não Informada","NÃO",30696.06,1534.8,1534.8,0,0,27626.46,22712.37,2498.36,4996.72,42,10386.84,2498.36,31728,1586.4,1586.4,0,0,28555.200000000001,23775.3,2615.2800000000002,5230.5600000000004,10736.02,2615.2800000000002]
[null,48,20155,"0171962-63.2025.3.00.0000","2025-05-14","2025-09-01","MS 6.040/DF","1998-11-16","Administrativo - Servidor Público Civil - Sistema Remuneratório e Benefícios (PRINCIPAL)","2003-10-01","União","Superintendência de Seguros Privados - SUSEP","Incorporação da diferença de 3,17%","Dedução de Honorários Contratuais","Alimentar","Não","Não","Não","-","-","Não informada","Não Informada","NÃO",17043.68,852.18,852.18,0,0,15339.32,0,0,0,42,5200.17,0,17616.650000000001,880.83,880.83,0,0,15854.99,0,0,0,5374.98,0]
[null,49,20156,"0171995-53.2025.3.00.0000","2025-05-14","2025-09-01","MS 6.040/DF","1998-11-16","Administrativo - Servidor Público Civil - Sistema Remuneratório e Benefícios (PRINCIPAL)","2003-10-01","União","Superintendência de Seguros Privados - SUSEP","Incorporação da diferença de 3,17%","Dedução de Honorários Contratuais","Alimentar","Não","Não","Não","-","-","Não informada","Não Informada","NÃO",10893.09,544.65,544.65,0,0,9803.7900000000009,8611.61,947.27,1894.54,42,3598.86,947.27,11259.28,562.96,562.96,0,0,10133.36,9014.6299999999992,991.6,1983.2,3719.84,991.6]
[null,50,20157,"0172000-75.2025.3.00.0000","2025-05-14","2025-09-01","MS 6.040/DF","1998-11-16","Administrativo - Servidor Público Civil - Sistema Remuneratório e Benefícios (PRINCIPAL)","2003-10-01","União","Superintendência de Seguros Privados - SUSEP","Incorporação da diferença de 3,17%","Dedução de Honorários Contratuais","Alimentar","Não","Não","Não","-","-","Não informada","Não Informada","NÃO",7785.42,389.27,389.27,0,0,7006.88,10994.12,1209.3499999999999,2418.6999999999998,42,1806.79,1209.3499999999999,8047.14,402.35,402.35,0,0,7242.44,11508.64,1265.95,2531.9,1867.54,1265.95]
[null,51,20158,"0172016-29.2025.3.00.0000","2025-05-14","2025-09-01","MS 6.040/DF","1998-11-16","Administrativo - Servidor Público Civil - Sistema Remuneratório e Benefícios (PRINCIPAL)","2003-10-01","União","Superintendência de Seguros Privados - SUSEP","Incorporação da diferença de 3,17%","Dedução de Honorários Contratuais","Alimentar","Não","Não","Não","-","-","Não informada","Não Informada","NÃO",8175.44,408.77,408.77,0,0,7357.9,8466.09,931.26,1862.52,42,2006.49,931.26,8450.27,422.51,422.51,0,0,7605.25,8862.2999999999993,974.85,1949.7,2073.94,974.85]
[null,52,20159,"0172049-19.2025.3.00.0000","2025-05-14","2025-09-01","MS 6.040/DF","1998-11-16","Administrativo - Servidor Público Civil - Sistema Remuneratório e Benefícios (PRINCIPAL)","2003-10-01","União","Superintendência de Seguros Privados - SUSEP","Incorporação da diferença de 3,17%","Dedução de Honorários Contratuais","Alimentar","Não","Não","Não","-","-","Não informada","Não Informada","NÃO",4893.41,244.67,244.67,0,0,4404.07,0,0,0,42,1088.4100000000001,0,5057.91,252.89,252.89,0,0,4552.13,0,0,0,1125.01,0]
[null,53,20160,"0172056-11.2025.3.00.0000","2025-05-14","2025-09-01","MS 6.040/DF","1998-11-16","Administrativo - Servidor Público Civil - Sistema Remuneratório e Benefícios (PRINCIPAL)","2003-10-01","União","Superintendência de Seguros Privados - SUSEP","Incorporação da diferença de 3,17%","Dedução de Honorários Contratuais","Alimentar","Não","Não","Não","-","-","Não informada","Não Informada","NÃO",20636.75,1031.83,1031.83,0,0,18573.09,0,0,0,42,6366.24,0,21330.51,1066.52,1066.52,0,0,19197.47,0,0,0,6580.25,0]
[null,54,20161,"0172081-24.2025.3.00.0000","2025-05-14","2025-09-01","MS 6.040/DF","1998-11-16","Administrativo - Servidor Público Civil - Sistema Remuneratório e Benefícios (PRINCIPAL)","2003-10-01","União","Superintendência de Seguros Privados - SUSEP","Incorporação da diferença de 3,17%","Dedução de Honorários Contratuais","Alimentar","Não","Não","Não","-","-","Não informada","Não Informada","NÃO",7555.71,377.78,377.78,0,0,6800.15,10185.6,1120.4100000000001,2240.8200000000002,42,1830.58,1120.4100000000001,7809.71,390.48,390.48,0,0,7028.75,10662.28,1172.8499999999999,2345.6999999999998,1892.12,1172.8499999999999]
[null,55,20162,"0172084-76.2025.3.00.0000","2025-05-14","2025-09-01","MS 6.040/DF","1998-11-16","Administrativo - Servidor Público Civil - Sistema Remuneratório e Benefícios (PRINCIPAL)","2003-10-01","União","Superintendência de Seguros Privados - SUSEP","Incorporação da diferença de 3,17%","Dedução de Honorários Contratuais","Alimentar","Não","Não","Não","-","-","Não informada","Não Informada","NÃO",7824.57,391.22,391.22,0,0,7042.13,0,0,0,42,1921.13,0,8087.6,404.38,404.38,0,0,7278.84,0,0,0,1985.69,0]
[null,56,20163,"0172130-65.2025.3.00.0000","2025-05-14","2025-09-01","MS 6.040/DF","1998-11-16","Administrativo - Servidor Público Civil - Sistema Remuneratório e Benefícios (PRINCIPAL)","2003-10-01","União","Superintendência de Seguros Privados - SUSEP","Incorporação da diferença de 3,17%","Dedução de Honorários Contratuais","Alimentar","Não","Não","Não","-","-","Não informada","Não Informada","NÃO",17585.72,879.28,879.28,0,0,15827.16,20054.48,2205.9899999999998,4411.9799999999996,42,4622.71,2205.9899999999998,18176.91,908.84,908.84,0,0,16359.23,20993.02,2309.23,4618.46,4778.1099999999997,2309.23]
[null,57,20164,"0172186-98.2025.3.00.0000","2025-05-14","2025-09-01","MS 6.040/DF","1998-11-16","Administrativo - Servidor Público Civil - Sistema Remuneratório e Benefícios (PRINCIPAL)","2003-10-01","União","Superintendência de Seguros Privados - SUSEP","Incorporação da diferença de 3,17%","Dedução de Honorários Contratuais","Alimentar","Não","Não","Não","-","-","Não informada","Não Informada","NÃO",10151.040000000001,507.55,507.55,0,0,9135.94,12319.12,1355.1,2710.2,42,2609.4499999999998,1355.1,10492.29,524.61,524.61,0,0,9443.07,12895.65,1418.52,2837.04,2697.18,1418.52]
[null,58,20165,"0172193-90.2025.3.00.0000","2025-05-14","2025-09-01","MS 6.040/DF","1998-11-16","Administrativo - Servidor Público Civil - Sistema Remuneratório e Benefícios (PRINCIPAL)","2003-10-01","União","Superintendência de Seguros Privados - SUSEP","Incorporação da diferença de 3,17%","Dedução de Honorários Contratuais","Alimentar","Não","Não","Não","-","-","Não informada","Não Informada","NÃO",4196.29,209.81,209.81,0,0,3776.67,0,0,0,42,936.83,0,4337.3599999999997,216.86,216.86,0,0,3903.64,0,0,0,968.33,0]
[null,59,20166,"0172200-82.2025.3.00.0000","2025-05-14","2025-09-01","MS 6.040/DF","1998-11-16","Administrativo - Servidor Público Civil - Sistema Remuneratório e Benefícios (PRINCIPAL)","2003-10-01","União","Superintendência de Seguros Privados - SUSEP","Incorporação da diferença de 3,17%","Dedução de Honorários Contratuais","Alimentar","Não","Não","Não","-","-","Não informada","Não Informada","NÃO",17374.09,868.7,868.7,0,0,15636.69,171.35,18.84,37.68,42,5207.37,18.84,17958.169999999998,897.9,897.9,0,0,16162.37,179.36,19.72,39.44,5382.44,19.72]
[null,60,20167,"0172206-89.2025.3.00.0000","2025-05-14","2025-09-01","MS 6.040/DF","1998-11-16","Administrativo - Servidor Público Civil - Sistema Remuneratório e Benefícios (PRINCIPAL)","2003-10-01","União","Superintendência de Seguros Privados - SUSEP","Incorporação da diferença de 3,17%","Dedução de Honorários Contratuais","Alimentar","Não","Não","Não","-","-","Não informada","Não Informada","NÃO",8616.0300000000007,430.8,430.8,0,0,7754.43,0,0,0,42,2122.6799999999998,0,8905.67,445.28,445.28,0,0,8015.11,0,0,0,2194.04,0]
[null,61,20168,"0172212-96.2025.3.00.0000","2025-05-14","2025-09-01","MS 6.040/DF","1998-11-16","Administrativo - Servidor Público Civil - Sistema Remuneratório e Benefícios (PRINCIPAL)","2003-10-01","União","Superintendência de Seguros Privados - SUSEP","Incorporação da diferença de 3,17%","Dedução de Honorários Contratuais","Alimentar","Não","Não","Não","-","-","Não informada","Não Informada","NÃO",13519.29,675.96,675.96,0,0,12167.37,14253.61,1567.89,3135.78,42,3846.46,1567.89,13973.78,698.68,698.68,0,0,12576.42,14920.67,1641.27,3282.54,3975.78,1641.27]
[null,62,20169,"0172221-58.2025.3.00.0000","2025-05-14","2025-09-01","MS 6.040/DF","1998-11-16","Administrativo - Servidor Público Civil - Sistema Remuneratório e Benefícios (PRINCIPAL)","2003-10-01","União","Superintendência de Seguros Privados - SUSEP","Incorporação da diferença de 3,17%","Dedução de Honorários Contratuais","Alimentar","Não","Não","Não","-","-","Não informada","Não Informada","NÃO",7058.73,352.93,352.93,0,0,6352.87,0,0,0,42,2340.33,0,7296.02,364.8,364.8,0,0,6566.42,0,0,0,2418.9899999999998,0]
[null,63,20170,"0172257-03.2025.3.00.0000","2025-05-14","2025-09-01","MS 6.040/DF","1998-11-16","Administrativo - Servidor Público Civil - Sistema Remuneratório e Benefícios (PRINCIPAL)","2003-10-01","União","Superintendência de Seguros Privados - SUSEP","Incorporação da diferença de 3,17%","Dedução de Honorários Contratuais","Alimentar","Não","Não","Não","-","-","Não informada","Não Informada","NÃO",5464.67,273.23,273.23,0,0,4918.21,0,0,0,42,1234.69,0,5648.37,282.41000000000003,282.41000000000003,0,0,5083.55,0,0,0,1276.2,0]
[null,64,20171,"0172268-32.2025.3.00.0000","2025-05-14","2025-09-01","MS 6.040/DF","1998-11-16","Administrativo - Servidor Público Civil - Sistema Remuneratório e Benefícios (PRINCIPAL)","2003-10-01","União","Superintendência de Seguros Privados - SUSEP","Incorporação da diferença de 3,17%","Dedução de Honorários Contratuais","Alimentar","Não","Não","Não","-","-","Não informada","Não Informada","NÃO",23505.11,1175.25,1175.25,0,0,21154.61,15496.95,1704.66,3409.32,42,8497.39,1704.66,24295.3,1214.76,1214.76,0,0,21865.78,16222.2,1784.44,3568.88,8783.0499999999993,1784.44]
[null,65,20172,"0172272-69.2025.3.00.0000","2025-05-14","2025-09-01","MS 6.040/DF","1998-11-16","Administrativo - Servidor Público Civil - Sistema Remuneratório e Benefícios (PRINCIPAL)","2003-10-01","União","Superintendência de Seguros Privados - SUSEP","Incorporação da diferença de 3,17%","Dedução de Honorários Contratuais","Alimentar","Não","Não","Não","-","-","Não informada","Não Informada","NÃO",8734.42,436.72,436.72,0,0,7860.98,9362.8700000000008,1029.9100000000001,2059.8200000000002,42,2541.31,1029.9100000000001,9028.0400000000009,451.4,451.4,0,0,8125.24,9801.0499999999993,1078.1099999999999,2156.2199999999998,2626.74,1078.1099999999999]
[null,66,20173,"0172307-29.2025.3.00.0000","2025-05-14","2025-09-01","MS 6.040/DF","1998-11-16","Administrativo - Servidor Público Civil - Sistema Remuneratório e Benefícios (PRINCIPAL)","2003-10-01","União","Superintendência de Seguros Privados - SUSEP","Incorporação da diferença de 3,17%","Dedução de Honorários Contratuais","Alimentar","Não","Não","Não","-","-","Não informada","Não Informada","NÃO",6619.88,330.99,330.99,0,0,5957.9,6001.48,660.16,1320.32,42,2101.86,660.16,6842.42,342.12,342.12,0,0,6158.18,6282.34,691.05,1382.1,2172.5100000000002,691.05]
[null,{"$f":"IF(C77=\"\",\"\",B76+1)","v":67},20174,"0172312-51.2025.3.00.0000","2025-05-14","2025-09-01","MS 6.040/DF","1998-11-16","Administrativo - Servidor Público Civil - Sistema Remuneratório e Benefícios (PRINCIPAL)","2003-10-01","União","Superintendência de Seguros Privados - SUSEP","Incorporação da diferença de 3,17%","Dedução de Honorários Contratuais","Alimentar","Não","Não","Não","-","-","Não informada","Não Informada","NÃO",15925.7,796.28,796.28,0,0,14333.14,14773.81,1625.11,3250.22,42,4917.6899999999996,1625.11,16461.09,823.05,823.05,0,0,14814.99,15465.22,1701.17,3402.34,5083.01,1701.17]
[null,68,20187,"0172566-24.2025.3.00.0000","2025-05-14","2025-09-01","MS 10.424/DF","2005-02-17","Administrativo - Servidor Público Civil - Sistema Remuneratório e Benefícios - Gratificações","2005-10-27","União","Ministério do Planejamento, Orçamento e Gestão","Gratificação Específica de Atividade Docente - GEAD","Dedução de Honorários Contratuais","Alimentar","Não","Não","Não","-","-","Não informada","Não Informada","NÃO",40703.32,4477.3599999999997,0,0,0,36225.96,21761.83,2393.8000000000002,0,9,17284.47,2393.8000000000002,42071.69,4627.88,0,0,0,37443.81,22493.42,2474.27,0,17865.54,2474.27]
[null,69,20188,"0173857-59.2025.3.00.0000","2025-05-15","2025-09-01","MS 10.424/DF","2005-02-17","Administrativo - Servidor Público Civil - Sistema Remuneratório e Benefícios - Gratificações","2005-10-27","União","Ministério do Planejamento, Orçamento e Gestão","Gratificação Específica de Atividade Docente - GEAD","Dedução de Honorários Contratuais","Alimentar","Não","Não","Não","-","-","Não informada","Não Informada","NÃO",6866.61,755.32,0,0,0,6111.29,3671.21,403.83,0,9,2915.89,403.83,7097.45,780.71,0,0,0,6316.74,3794.63,417.4,0,3013.92,417.4]
[null,70,20189,"0173877-50.2025.3.00.0000","2025-05-15","2025-09-01","MS 10.424/DF","2005-02-17","Administrativo - Servidor Público Civil - Sistema Remuneratório e Benefícios - Gratificações","2005-10-27","União","Ministério do Planejamento, Orçamento e Gestão","Gratificação Específica de Atividade Docente - GEAD","Dedução de Honorários Contratuais","Alimentar","Não","Não","Não","-","-","Não informada","Não Informada","NÃO",6866.61,755.32,0,0,0,6111.29,3671.21,403.83,0,9,2915.89,403.83,7097.45,780.71,0,0,0,6316.74,3794.63,417.4,0,3013.92,417.4]
[null,71,20190,"0173882-72.2025.3.00.0000","2025-05-15","2025-09-01","MS 10.424/DF","2005-02-17","Administrativo - Servidor Público Civil - Sistema Remuneratório e Benefícios - Gratificações","2005-10-27","União","Ministério do Planejamento, Orçamento e Gestão","Gratificação Específica de Atividade Docente - GEAD","Dedução de Honorários Contratuais","Alimentar","Não","Não","Não","-","-","Não informada","Não Informada","NÃO",6866.61,755.32,0,0,0,6111.29,3671.21,403.83,0,9,2915.89,403.83,7097.45,780.71,0,0,0,6316.74,3794.63,417.4,0,3013.92,417.4]
[null,72,20191,"0173884-42.2025.3.00.0000","2025-05-15","2025-09-01","MS 10.424/DF","2005-02-17","Administrativo - Servidor Público Civil - Sistema Remuneratório e Benefícios - Gratificações","2005-10-27","União","Ministério do Planejamento, Orçamento e Gestão","Gratificação Específica de Atividade Docente - GEAD","Dedução de Honorários Contratuais","Alimentar","Não","Não","Não","-","-","Não informada","Não Informada","NÃO",6866.61,755.32,0,0,0,6111.29,3671.21,403.83,0,9,2915.89,403.83,7097.45,780.71,0,0,0,6316.74,3794.63,417.4,0,3013.92,417.4]
[null,73,20193,"0173909-55.2025.3.00.0000","2025-05-15","2025-09-01","MS 10.424/DF","2005-02-17","Administrativo - Servidor Público Civil - Sistema Remuneratório e Benefícios - Gratificações","2005-10-27","União","Ministério do Planejamento, Orçamento e Gestão","Gratificação Específica de Atividade Docente - GEAD","Dedução de Honorários Contratuais","Alimentar","Não","Não","Não","-","-","Não informada","Não Informada","NÃO",6866.61,755.32,0,0,0,6111.29,3671.21,403.83,0,9,2915.89,403.83,7097.45,780.71,0,0,0,6316.74,3794.63,417.4,0,3013.92,417.4]
[null,74,20194,"0173915-62.2025.3.00.0000","2025-05-15","2025-09-01","MS 10.424/DF","2005-02-17","Administrativo - Servidor Público Civil - Sistema Remuneratório e Benefícios - Gratificações","2005-10-27","União","Ministério do Planejamento, Orçamento e Gestão","Gratificação Específica de Atividade Docente - GEAD","Dedução de Honorários Contratuais","Alimentar","Não","Não","Não","-","-","Não informada","Não Informada","NÃO",6866.61,755.32,0,0,0,6111.29,3671.21,403.83,0,9,2915.89,403.83,7097.45,780.71,0,0,0,6316.74,3794.63,417.4,0,3013.92,417.4]
[null,75,20196,"0173919-02.2025.3.00.0000","2025-05-15","2025-09-01","MS 10.424/DF","2005-02-17","Administrativo - Servidor Público Civil - Sistema Remuneratório e Benefícios - Gratificações","2005-10-27","União","Ministério do Planejamento, Orçamento e Gestão","Gratificação Específica de Atividade Docente - GEAD","Dedução de Honorários Contratuais","Alimentar","Não","Não","Não","-","-","Não informada","Não Informada","NÃO",6866.61,755.32,0,0,0,6111.29,3671.21,403.83,0,9,2915.89,403.83,7097.45,780.71,0,0,0,6316.74,3794.63,417.4,0,3013.92,417.4]
[null,76,20198,"0173975-35.2025.3.00.0000","2025-05-15","2025-09-01","MS 10.424/DF","2005-02-17","Administrativo - Servidor Público Civil - Sistema Remuneratório e Benefícios - Gratificações","2005-10-27","União","Ministério do Planejamento, Orçamento e Gestão","Gratificação Específica de Atividade Docente - GEAD","Dedução de Honorários Contratuais","Alimentar","Não","Não","Não","-","-","Não informada","Não Informada","NÃO",6866.61,755.32,0,0,0,6111.29,3671.21,403.83,0,9,2915.89,403.83,7097.45,780.71,0,0,0,6316.74,3794.63,417.4,0,3013.92,417.4]
[null,77,20199,"0173976-20.2025.3.00.0000","2025-05-15","2025-09-01","MS 10.424/DF","2005-02-17","Administrativo - Servidor Público Civil - Sistema Remuneratório e Benefícios - Gratificações","2005-10-27","União","Ministério do Planejamento, Orçamento e Gestão","Gratificação Específica de Atividade Docente - GEAD","Dedução de Honorários Contratuais","Alimentar","Não","Não","Não","-","-","Não informada","Não Informada","NÃO",6866.61,755.32,0,0,0,6111.29,3671.21,403.83,0,9,2915.89,403.83,7097.45,780.71,0,0,0,6316.74,3794.63,417.4,0,3013.92,417.4]
[null,78,20200,"0173980-57.2025.3.00.0000","2025-05-15","2025-09-01","MS 10.424/DF","2005-02-17","Administrativo - Servidor Público Civil - Sistema Remuneratório e Benefícios - Gratificações","2005-10-27","União","Ministério do Planejamento, Orçamento e Gestão","Gratificação Específica de Atividade Docente - GEAD","Dedução de Honorários Contratuais","Alimentar","Não","Não","Não","-","-","Não informada","Não Informada","NÃO",6866.61,755.32,0,0,0,6111.29,3671.21,403.83,0,9,2915.89,403.83,7097.45,780.71,0,0,0,6316.74,3794.63,417.4,0,3013.92,417.4]
[null,79,20201,"0174008-25.2025.3.00.0000","2025-05-15","2025-09-01","MS 10.424/DF","2005-02-17","Administrativo - Servidor Público Civil - Sistema Remuneratório e Benefícios - Gratificações","2005-10-27","União","Ministério do Planejamento, Orçamento e Gestão","Gratificação Específica de Atividade Docente - GEAD","Dedução de Honorários Contratuais","Alimentar","Não","Não","Não","-","-","Não informada","Não Informada","NÃO",6866.61,755.32,0,0,0,6111.29,3671.21,403.83,0,9,2915.89,403.83,7097.45,780.71,0,0,0,6316.74,3794.63,417.4,0,3013.92,417.4]
[null,80,20202,"0174012-62.2025.3.00.0000","2025-05-15","2025-09-01","MS 10.424/DF","2005-02-17","Administrativo - Servidor Público Civil - Sistema Remuneratório e Benefícios - Gratificações","2005-10-27","União","Ministério do Planejamento, Orçamento e Gestão","Gratificação Específica de Atividade Docente - GEAD","Dedução de Honorários Contratuais","Alimentar","Não","Não","Não","-","-","Não informada","Não Informada","NÃO",6866.61,755.32,0,0,0,6111.29,3671.21,403.83,807.66,9,2915.89,403.83,7097.45,780.71,0,0,0,6316.74,3794.63,417.4,834.8,3013.92,417.4]
[null,81,20203,"0174017-84.2025.3.00.0000","2025-05-15","2025-09-01","MS 10.424/DF","2005-02-17","Administrativo - Servidor Público Civil - Sistema Remuneratório e Benefícios - Gratificações","2005-10-27","União","Ministério do Planejamento, Orçamento e Gestão","Gratificação Específica de Atividade Docente - GEAD","Dedução de Honorários Contratuais","Alimentar","Não","Não","Não","-","-","Não informada","Não Informada","NÃO",6866.61,755.32,0,0,0,6111.29,3671.21,403.83,0,9,2915.89,403.83,7097.45,780.71,0,0,0,6316.74,3794.63,417.4,0,3013.92,417.4]
[null,82,20205,"0174046-37.2025.3.00.0000","2025-05-15","2025-09-01","MS 10.424/DF","2005-02-17","Administrativo - Servidor Público Civil - Sistema Remuneratório e Benefícios - Gratificações","2005-10-27","União","Ministério do Planejamento, Orçamento e Gestão","Gratificação Específica de Atividade Docente - GEAD","Dedução de Honorários Contratuais","Alimentar","Não","Não","Não","-","-","Não informada","Não Informada","NÃO",6866.61,755.32,0,0,0,6111.29,3671.21,403.83,0,9,2915.89,403.83,7097.45,780.71,0,0,0,6316.74,3794.63,417.4,0,3013.92,417.4]
[null,83,20206,"0174048-07.2025.3.00.0000","2025-05-15","2025-09-01","MS 10.424/DF","2005-02-17","Administrativo - Servidor Público Civil - Sistema Remuneratório e Benefícios - Gratificações","2005-10-27","União","Ministério do Planejamento, Orçamento e Gestão","Gratificação Específica de Atividade Docente - GEAD","Dedução de Honorários Contratuais","Alimentar","Não","Não","Não","-","-","Não informada","Não Informada","NÃO",6866.61,755.32,0,0,0,6111.29,3671.21,403.83,0,9,2915.89,403.83,7097.45,780.71,0,0,0,6316.74,3794.63,417.4,0,3013.92,417.4]
[null,84,20207,"0174052-44.2025.3.00.0000","2025-05-15","2025-09-01","MS 10.424/DF","2005-02-17","Administrativo - Servidor Público Civil - Sistema Remuneratório e Benefícios - Gratificações","2005-10-27","União","Ministério do Planejamento, Orçamento e Gestão","Gratificação Específica de Atividade Docente - GEAD","Dedução de Honorários Contratuais","Alimentar","Não","Não","Não","-","-","Não informada","Não Informada","NÃO",6866.61,755.32,0,0,0,6111.29,3671.21,403.83,0,9,2915.89,403.83,7097.45,780.71,0,0,0,6316.74,3794.63,417.4,0,3013.92,417.4]
[null,85,20208,"0174056-81.2025.3.00.0000","2025-05-15","2025-09-01","MS 10.424/DF","2005-02-17","Administrativo - Servidor Público Civil - Sistema Remuneratório e Benefícios - Gratificações","2005-10-27","União","Ministério do Planejamento, Orçamento e Gestão","Gratificação Específica de Atividade Docente - GEAD","Dedução de Honorários Contratuais","Alimentar","Não","Não","Não","-","-","Não informada","Não Informada","NÃO",6866.61,755.32,0,0,0,6111.29,3671.21,403.83,0,9,2915.89,403.83,7097.45,780.71,0,0,0,6316.74,3794.63,417.4,0,3013.92,417.4]
[null,86,20209,"0174062-88.2025.3.00.0000","2025-05-15","2025-09-01","MS 10.424/DF","2005-02-17","Administrativo - Servidor Público Civil - Sistema Remuneratório e Benefícios - Gratificações","2005-10-27","União","Ministério do Planejamento, Orçamento e Gestão","Gratificação Específica de Atividade Docente - GEAD","Dedução de Honorários Contratuais","Alimentar","Não","Não","Não","-","-","Não informada","Não Informada","NÃO",6866.61,755.32,0,0,0,6111.29,3671.21,403.83,0,9,2915.89,403.83,7097.45,780.71,0,0,0,6316.74,3794.63,417.4,0,3013.92,417.4]
[null,87,20210,"0174063-73.2025.3.00.0000","2025-05-15","2025-09-01","MS 10.424/DF","2005-02-17","Administrativo - Servidor Público Civil - Sistema Remuneratório e Benefícios - Gratificações","2005-10-27","União","Ministério do Planejamento, Orçamento e Gestão","Gratificação Específica de Atividade Docente - GEAD","Dedução de Honorários Contratuais","Alimentar","Não","Não","Não","-","-","Não informada","Não Informada","NÃO",6866.61,755.32,0,0,0,6111.29,3671.21,403.83,807.66,9,2915.89,403.83,7097.45,780.71,0,0,0,6316.74,3794.63,417.4,834.8,3013.92,417.4]
[null,88,20214,"0180406-85.2025.3.00.0000","2025-05-20","2025-09-01","AR 1.169/CE","1999-10-18","Administrativo - Servidor Público Civil - Sistema Remuneratório e Benefícios","2004-06-07","Instituto Nacional do Seguro Social – INSS","Instituto Nacional do Seguro Social - INSS","Anuênios","Dedução de Honorários Contratuais","Alimentar","Não","Não","Não","-","-","Não informada","Não Informada","NÃO",22376.87,4475.37,0,0,0,17901.5,5904.59,649.5,1299,101,2293.14,649.5,23129.13,4625.82,0,0,0,18503.310000000001,6180.92,679.9,1359.8,2370.23,679.9]
[null,89,20215,"0180411-10.2025.3.00.0000","2025-05-20","2025-09-01","AR 1.169/CE","1999-10-18","Administrativo - Servidor Público Civil - Sistema Remuneratório e Benefícios","2004-06-07","Instituto Nacional do Seguro Social – INSS","Instituto Nacional do Seguro Social - INSS","Anuênios","Dedução de Honorários Contratuais","Alimentar","Não","Não","Não","-","-","Não informada","Não Informada","NÃO",33590.620000000003,6718.12,0,0,0,26872.5,8627.1299999999992,948.98,1897.96,60,3442.24,948.98,34719.870000000003,6943.97,0,0,0,27775.9,9030.8700000000008,993.39,1986.78,3557.96,993.39]
[null,90,20216,"0180415-47.2025.3.00.0000","2025-05-20","2025-09-01","AR 1.169/CE","1999-10-18","Administrativo - Servidor Público Civil - Sistema Remuneratório e Benefícios","2004-06-07","Instituto Nacional do Seguro Social – INSS","Instituto Nacional do Seguro Social - INSS","Anuênios","Dedução de Honorários Contratuais","Alimentar","Não","Não","Não","-","-","Não informada","Não Informada","NÃO",11888.36,1188.83,0,0,0,10699.53,3595.89,395.54,791.08,115,2407.06,395.54,12288.01,1228.8,0,0,0,11059.21,3716.77,408.84,817.68,2487.9699999999998,408.84]
[null,91,20217,"0180443-15.2025.3.00.0000","2025-05-20","2025-09-01","AR 1.169/CE","1999-10-18","Administrativo - Servidor Público Civil - Sistema Remuneratório e Benefícios","2004-06-07","Instituto Nacional do Seguro Social – INSS","Instituto Nacional do Seguro Social - INSS","Anuênios","Dedução de Honorários Contratuais","Alimentar","Não","Não","Não","-","-","Não informada","Não Informada","NÃO",23047.18,2304.71,0,0,0,20742.47,3065.93,337.25,674.5,115,4666.38,337.25,23821.98,2382.19,0,0,0,21439.79,3209.41,353.03,706.06,4823.25,353.03]
[null,92,20218,"0180449-22.2025.3.00.0000","2025-05-20","2025-09-01","AR 1.169/CE","1999-10-18","Administrativo - Servidor Público Civil - Sistema Remuneratório e Benefícios","2004-06-07","Instituto Nacional do Seguro Social – INSS","Instituto Nacional do Seguro Social - INSS","Anuênios","Dedução de Honorários Contratuais","Alimentar","Não","Não","Não","-","-","Não informada","Não Informada","NÃO",25823.24,2582.3200000000002,0,0,0,23240.92,7392.25,813.14,1626.28,111,5228.6400000000003,813.14,26691.37,2669.13,0,0,0,24022.240000000002,7738.2,851.2,1702.4,5404.42,851.2]
[null,93,20219,"0180453-59.2025.3.00.0000","2025-05-20","2025-09-01","AR 1.169/CE","1999-10-18","Administrativo - Servidor Público Civil - Sistema Remuneratório e Benefícios","2004-06-07","Instituto Nacional do Seguro Social – INSS","Instituto Nacional do Seguro Social - INSS","Anuênios","Dedução de Honorários Contratuais","Alimentar","Não","Não","Não","-","-","Não informada","Não Informada","NÃO",18866.55,1886.65,0,0,0,16979.900000000001,5706.74,627.74,1255.48,112,3820.09,627.74,19500.810000000001,1950.08,0,0,0,17550.73,5898.59,648.84,1297.68,3948.51,648.84]
[null,94,20220,"0180458-81.2025.3.00.0000","2025-05-20","2025-09-01","AR 1.169/CE","1999-10-18","Administrativo - Servidor Público Civil - Sistema Remuneratório e Benefícios","2004-06-07","Instituto Nacional do Seguro Social – INSS","Instituto Nacional do Seguro Social - INSS","Anuênios","Dedução de Honorários Contratuais","Alimentar","Não","Não","Não","-","-","Não informada","Não Informada","NÃO",18732.810000000001,1873.28,0,0,0,16859.53,5666.13,623.27,1246.54,116,3792.85,623.27,19362.560000000001,1936.25,0,0,0,17426.310000000001,5856.61,644.22,1288.44,3920.36,644.22]
[null,95,20222,"0180476-05.2025.3.00.0000","2025-05-20","2025-09-01","AR 1.169/CE","1999-10-18","Administrativo - Servidor Público Civil - Sistema Remuneratório e Benefícios","2004-06-07","Instituto Nacional do Seguro Social – INSS","Instituto Nacional do Seguro Social - INSS","Anuênios","Dedução de Honorários Contratuais","Alimentar","Não","Não","Não","-","-","Não informada","Não Informada","NÃO",20562.650000000001,2056.2600000000002,0,0,0,18506.39,1111.21,122.23,244.46,60,4163.46,122.23,21253.919999999998,2125.39,0,0,0,19128.53,1163.21,127.95,255.9,4303.42,127.95]
[null,96,20223,"0180550-59.2025.3.00.0000","2025-05-20","2025-09-01","AR 1.169/CE","1999-10-18","Administrativo - Servidor Público Civil - Sistema Remuneratório e Benefícios","2004-06-07","Instituto Nacional do Seguro Social – INSS","Instituto Nacional do Seguro Social - INSS","Anuênios","Dedução de Honorários Contratuais","Alimentar","Não","Não","Não","-","-","Não informada","Não Informada","NÃO",20627.169999999998,2062.71,0,0,0,18564.46,6239.29,686.32,1372.64,108,4176.58,686.32,21320.61,2132.06,0,0,0,19188.55,6449.04,709.39,1418.78,4316.9799999999996,709.39]
[null,97,20224,"0180559-21.2025.3.00.0000","2025-05-20","2025-09-01","AR 1.169/CE","1999-10-18","Administrativo - Servidor Público Civil - Sistema Remuneratório e Benefícios","2004-06-07","Instituto Nacional do Seguro Social – INSS","Instituto Nacional do Seguro Social - INSS","Anuênios","Dedução de Honorários Contratuais","Alimentar","Não","Não","Não","-","-","Não informada","Não Informada","NÃO",14640.56,1464.05,0,0,0,13176.51,4428.47,487.13,974.26,105,2964.42,487.13,15132.74,1513.27,0,0,0,13619.47,4577.34,503.5,1007,3064.07,503.5]
[null,98,20244,"0182656-91.2025.3.00.0000","2025-05-21","2025-09-01","MS 6.864/DF","2000-04-05","Administrativo - Servidor Público Civil - Sistema Remuneratório e Benefícios","2006-05-03","Instituto Nacional do Seguro Social – INSS","Ministério do Planejamento, Orçamento e Gestão","Reajuste  3,17% - Lei 8.880/94","Dedução de Honorários Contratuais","Alimentar","Não","Não","Não","-","-","Não informada","Não Informada","NÃO",57840.36,3470.42,0,0,0,54369.94,0,0,0,18,12872.43,0,59784.84,3587.09,0,0,0,56197.75,0,0,0,13305.17,0]
[null,99,20246,"0190006-33.2025.3.00.0000","2025-05-26","2025-09-01","MS 4.151/DF","1995-07-21","Administrativo - Servidor Público Civil - Reajustes de Remuneração, Proventos ou Pensão","1999-02-12","União","Ministério da Fazenda","Diferença de remuneração - 3,17%","Dedução de Honorários Contratuais","Alimentar","Não","Não","Não","-","-","Não informada","Não Informada","NÃO",81336.25,4880.17,813.36,813.36,0,74829.36,0,0,0,53,23140.91,0,84070.62,5044.2299999999996,840.7,840.7,0,77344.990000000005,0,0,0,23918.87,0]
[null,100,20247,"0190007-18.2025.3.00.0000","2025-05-26","2025-09-01","MS 4.151/DF","1995-07-21","Administrativo - Servidor Público Civil - Reajustes de Remuneração, Proventos ou Pensão","1999-02-12","União","Ministério da Fazenda","Diferença de remuneração - 3,17%","Dedução de Honorários Contratuais","Alimentar","Não","Não","Não","-","-","Não informada","Não Informada","NÃO",82938.61,4976.3100000000004,829.38,829.38,0,76303.539999999994,39714.800000000003,4368.62,8737.24,53,22622.23,4368.62,85726.86,5143.6099999999997,857.26,857.26,0,78868.73,41573.449999999997,4573.07,9146.14,23382.75,4573.07]
[null,101,20251,"0190023-69.2025.3.00.0000","2025-05-26","2025-09-01","MS 19.042/DF","2012-08-15","Administrativo - Militar - Regime - Anistia Política (PRINCIPAL)","2023-11-22","União","Ministério da Justiça","Anistia Política - Reparação Econômica","Dedução de Honorários Contratuais","Comum","Não","Não","Não","-","-","Não informada","Não Informada","SIM",50932.18,12733.04,0,0,0,38199.14,0,0,0,0,0,0,52644.42,13161.1,0,0,0,39483.32,0,0,0,0,0]
[null,""]
[null,""]
[null,""]
[null,""]
[null,""]
[null,""]
[null,""]
[null,""]
[null,""]
[null,""]
[null,""]
[null,""]
[null,""]
[null,""]
[null,""]
[null,""]
[null,""]
[null,""]
[null,""]
[null,""]
[null,""]
[null,""]
[null,""]
[null,""]
[null,""]
[null,""]
[null,""]
[null,""]
[null,""]
[null,{"$f":"IF(C141=\"\",\"\",B140+1)","v":""}]
[null,""]
[null,""]
[null,""]
[null,""]
[null,""]
[null,""]
[null,""]
[null,""]
[null,""]
[null,""]
[null,""]
[null,""]
[null,""]
[null,""]
[null,""]
[null,""]
[null,""]
[null,""]
[null,""]
[null,""]
[null,""]
[null,""]
[null,""]
[null,""]
[null,""]
[null,""]
[null,""]
[null,""]
[null,""]
[null,""]
[null,""]
[null,""]
[null,""]
[null,""]
[null,""]
[null,""]
[null,""]
[null,""]
[null,""]
[null,""]
[null,""]
[null,""]
[null,""]
[null,""]
[null,""]
[null,""]
[null,""]
[null,""]
[null,""]
[null,""]
[null,""]
[null,""]
[null,""]
[null,""]
[null,""]
[null,""]
[null,""]
[null,""]
[null,""]
[null,""]
[null,""]
[null,""]
[null,""]
[null,{"$f":"IF(C205=\"\",\"\",B204+1)","v":""}]
[null,""]
[null,""]
[null,""]
[null,""]
[null,""]
[null,""]
[null,""]
[null,""]
[null,""]
[null,""]
[null,""]
[null,""]
[null,""]
[null,""]
[null,""]
[null,""]
[null,""]
[null,""]
[null,""]
[null,""]
[null,""]
[null,""]
[null,""]
[null,""]
[null,""]
[null,""]
[null,""]
[null,""]
[null,""]
[null,""]
[null,""]
[null,""]
[null,""]
[null,""]
[null,""]
[null,""]
[null,""]
[null,""]
[null,""]
[null,""]
[null,""]
[null,""]
[null,""]
[null,""]
[null,""]
[null,""]
[null,""]
[null,""]
[null,""]
[null,""]
[null,""]
[null,""]
[null,""]
[null,""]
[null,""]
[null,""]
[null,""]
[null,""]
[null,""]
[null,""]
[null,""]
[null,""]
[null,""]
[null,{"$f":"IF(C269=\"\",\"\",B268+1)","v":""}]
[null,""]
[null,""]
[null,""]
[null,""]
[null,""]
[null,""]
[null,""]
[null,""]
[null,""]
[null,""]
[null,""]
[null,""]
[null,""]
[null,""]
[null,""]
[null,""]
[null,""]
[null,""]
[null,""]
[null,""]
[null,""]
[null,""]
[null,""]
[null,""]
[null,""]
[null,""]
[null,""]
[null,""]
[null,""]
[null,""]
[null,""]
[null,""]
[null,""]
[null,""]
[null,""]
[null,""]
[null,""]
[null,""]
[null,""]
[null,""]
[null,""]
[null,""]
[null,""]
[null,""]
[null,""]
[null,""]
[null,""]
[null,""]
[null,""]
[null,""]
[null,""]
[null,""]
[null,""]
[null,""]
[null,""]
[null,""]
[null,""]
[null,""]
[null,""]
[null,""]
[null,""]
[null,""]
[null,""]
[null,{"$f":"IF(C333=\"\",\"\",B332+1)","v":""}]
[null,""]
[null,""]
[null,""]
[null,""]
[null,""]
[null,""]
[null,""]
[null,""]
[null,""]
[null,""]
[null,""]
[null,""]
[null,""]
[null,""]
[null,""]
[null,""]
[null,""]
[null,""]
[null,""]
[null,""]
[null,""]
[null,""]
[null,""]
[null,""]
[null,""]
[null,""]
[null,""]
[null,""]
[null,""]
[null,""]
[null,""]
[null,""]
[null,""]
[null,""]
[null,""]
[null,""]
[null,""]
[null,""]
[null,""]
[null,""]
[null,""]
[null,""]
[null,""]
[null,""]
[null,""]
[null,""]
[null,""]
[null,""]
[null,""]
[null,""]
[null,""]
[null,""]
[null,""]
[null,""]
[null,""]
[null,""]
[null,""]
[null,""]
[null,""]
[null,""]
[null,""]
[null,""]
[null,""]
[null,{"$f":"IF(C397=\"\",\"\",B396+1)","v":""}]
[null,""]
[null,""]
[null,""]
[null,""]
[null,""]
[null,""]
[null,""]
[null,""]
[null,""]
[null,""]
[null,""]
[null,""]
[null,""]
[null,""]
[null,""]
[null,""]
[null,""]
[null,""]
[null,""]
[null,""]
[null,""]
[null,""]
[null,""]
[null,""]
[null,""]
[null,""]
[null,""]
[null,""]
[null,""]
[null,""]
[null,""]
[null,""]
[null,""]
[null,""]
[null,""]
[null,""]
[null,""]
[null,""]
[null,""]
[null,""]
[null,""]
[null,""]
[null,""]
[null,""]
[null,""]
[null,""]
[null,""]
[null,""]
[null,""]
[null,""]
[null,""]
[null,""]
[null,""]
[null,""]
[null,""]
[null,""]
[null,""]
[null,""]
[null,""]
[null,""]
[null,""]
[null,""]
[null,""]
[null,{"$f":"IF(C461=\"\",\"\",B460+1)","v":""}]
[null,""]
[null,""]
[null,""]
[null,""]
[null,""]
[null,""]
[null,""]
[null,""]
[null,""]
[null,""]
[null,""]
[null,""]
[null,""]
[null,""]
[null,""]
[null,""]
[null,""]
[null,""]
[null,""]
[null,""]
[null,""]
[null,""]
[null,""]
[null,""]
[null,""]
[null,""]
[null,""]
[null,""]
[null,""]
[null,""]
[null,""]
[null,""]
[null,""]
[null,""]
[null,""]
[null,""]
[null,""]
[null,""]
[null,""]
[null,""]
[null,""]
[null,""]
[null,""]
[null,""]
[null,""]
[null,""]
[null,""]
[null,""]
[null,""]
[]
[null,null,null,null,null,null,null,null,null,null,null,null,null,null,null,null,null,null,null,null,null,null,null,null,null,null,null,null,null,null,null,null,null,null,"Totais pagas",{"$f":"SUM(AJ11:AJ510)","v":1839515.1299999997},{"$f":"SUM(AK11:AK510)","v":166578.35000000009},49875.05000000001,1697.96,0,{"$f":"SUM(AO11:AO510)","v":1621363.77}]

{"sheet":"Guia 2","index":1,"n_rows":512,"n_cols":46,"rows_kept":512,"cut":false,"hidden":true,"merged":[[4,2,4,8],[5,4,5,7],[6,2,6,5],[6,6,6,9],[6,10,6,11],[7,19,8,19],[6,15,6,22],[6,23,6,34],[6,35,6,45],[7,2,8,2],[7,3,8,3],[7,4,8,4],[7,5,8,5],[7,6,8,6],[7,7,8,7],[7,8,8,8],[6,14,8,14],[7,9,8,9],[7,10,8,10],[7,11,8,11],[7,12,8,12],[7,13,8,13],[7,15,8,15],[7,16,8,16],[7,17,8,17],[7,18,8,18],[7,35,7,40],[7,41,7,43],[7,44,7,45],[7,20,8,20],[7,21,8,21],[7,22,8,22],[7,23,7,28],[7,29,7,31],[7,32,7,34]]}
[]
[null,null,"Superior Tribunal de Justiça"]
[null,null,"Secretaria de Processamento de Feitos"]
[null,null,"Coordenadoria de Processamento de Feitos em Execução Judicial"]
[null,null,{"$f":"\"Relação das Requisições de Pequeno Valor - RPV pagas pelo STJ em \"&IF(F11=\"\",\"\",UPPER((TEXT(F11,\"mmmm/aaaa\"))))","v":"Relação das Requisições de Pequeno Valor - RPV pagas pelo STJ em "}]
[]
[null,null,"RPV",null,null,null,"P R O C E S S O     D E     O R I G E M",null,null,null,"E N T I D A D E S",null,"R E Q U E R E N T E","A D V O G A D O","Natureza do crédito","I N D I C A D O R E S",null,null,null,null,null,null,null,"VALORES REQUISITADOS",null,null,null,null,null,null,null,null,null,null,null,"VALORES ATUALIZADOS PARA PAGAMENTO"]
[null,null,"Nº","Registro","Autuada em","data do pgto","Ação","Autuada em","Tipo de causa","Trânsito","Entidade devedora","Órgão de origem","Origem do crédito","Origem do crédito",null,"Tributário","EC 94 2016","Lei 13.463 2017","PRC/RPV de origem","Nº DA GRU","DOENÇA GRAVE","Deficiência física","Isento de IR","Beneficiários",null,null,null,null,null,"PSSS",null,null,"R R A",null,null,"Beneficiários",null,null,null,null,null,"P S S S",null,null,"R R A"]
[null,null,null,null,null,null,null,null,null,null,null,null,null,null,null,null,null,null,null,null,null,null,null,"Total","Adv I","Adv II","Adv III","Adv IV","Requerente","Base","Desc","Patronal","NMA","Exercícios anteriores","Desconto","Total","Adv I","Adv II","Adv III","Adv IV","Reqte","BASE desc","Desc","Patronal","Exercícios anteriores","Dedução"]
[]
[null,{"$f":"IF(C11=\"\",\"\",1)","v":""}]
[null,{"$f":"IF(C12=\"\",\"\",B11+1)","v":""}]
[null,{"$f":"IF(C13=\"\",\"\",B12+1)","v":""}]
[null,""]
[null,""]
[null,""]
[null,""]
[null,""]
[null,""]
[null,""]
[null,""]
[null,""]
[null,""]
[null,""]
[null,""]
[null,""]
[null,""]
[null,""]
[null,""]
[null,""]
[null,""]
[null,""]
[null,""]
[null,""]
[null,""]
[null,""]
[null,""]
[null,""]
[null,""]
[null,""]
[null,""]
[null,""]
[null,""]
[null,""]
[null,""]
[null,""]
[null,""]
[null,""]
[null,""]
[null,""]
[null,""]
[null,""]
[null,""]
[null,""]
[null,""]
[null,""]
[null,""]
[null,""]
[null,""]
[null,""]
[null,""]
[null,""]
[null,""]
[null,""]
[null,""]
[null,""]
[null,""]
[null,""]
[null,""]
[null,""]
[null,""]
[null,""]
[null,""]
[null,""]
[null,""]
[null,""]
[null,{"$f":"IF(C77=\"\",\"\",B76+1)","v":""}]
[null,""]
[null,""]
[null,""]
[null,""]
[null,""]
[null,""]
[null,""]
[null,""]
[null,""]
[null,""]
[null,""]
[null,""]
[null,""]
[null,""]
[null,""]
[null,""]
[null,""]
[null,""]
[null,""]
[null,""]
[null,""]
[null,""]
[null,""]
[null,""]
[null,""]
[null,""]
[null,""]
[null,""]
[null,""]
[null,""]
[null,""]
[null,""]
[null,""]
[null,""]
[null,""]
[null,""]
[null,""]
[null,""]
[null,""]
[null,""]
[null,""]
[null,""]
[null,""]
[null,""]
[null,""]
[null,""]
[null,""]
[null,""]
[null,""]
[null,""]
[null,""]
[null,""]
[null,""]
[null,""]
[null,""]
[null,""]
[null,""]
[null,""]
[null,""]
[null,""]
[null,""]
[null,""]
[null,""]
[null,{"$f":"IF(C141=\"\",\"\",B140+1)","v":""}]
[null,""]
[null,""]
[null,""]
[null,""]
[null,""]
[null,""]
[null,""]
[null,""]
[null,""]
[null,""]
[null,""]
[null,""]
[null,""]
[null,""]
[null,""]
[null,""]
[null,""]
[null,""]
[null,""]
[null,""]
[null,""]
[null,""]
[null,""]
[null,""]
[null,""]
[null,""]
[null,""]
[null,""]
[null,""]
[null,""]
[null,""]
[null,""]
[null,""]
[null,""]
[null,""]
[null,""]
[null,""]
[null,""]
[null,""]
[null,""]
[null,""]
[null,""]
[null,""]
[null,""]
[null,""]
[null,""]
[null,""]
[null,""]
[null,""]
[null,""]
[null,""]
[null,""]
[null,""]
[null,""]
[null,""]
[null,""]
[null,""]
[null,""]
[null,""]
[null,""]
[null,""]
[null,""]
[null,""]
[null,{"$f":"IF(C205=\"\",\"\",B204+1)","v":""}]
[null,""]
[null,""]
[null,""]
[null,""]
[null,""]
[null,""]
[null,""]
[null,""]
[null,""]
[null,""]
[null,""]
[null,""]
[null,""]
[null,""]
[null,""]
[null,""]
[null,""]
[null,""]
[null,""]
[null,""]
[null,""]
[null,""]
[null,""]
[null,""]
[null,""]
[null,""]
[null,""]
[null,""]
[null,""]
[null,""]
[null,""]
[null,""]
[null,""]
[null,""]
[null,""]
[null,""]
[null,""]
[null,""]
[null,""]
[null,""]
[null,""]
[null,""]
[null,""]
[null,""]
[null,""]
[null,""]
[null,""]
[null,""]
[null,""]
[null,""]
[null,""]
[null,""]
[null,""]
[null,""]
[null,""]
[null,""]
[null,""]
[null,""]
[null,""]
[null,""]
[null,""]
[null,""]
[null,""]
[null,{"$f":"IF(C269=\"\",\"\",B268+1)","v":""}]
[null,""]
[null,""]
[null,""]
[null,""]
[null,""]
[null,""]
[null,""]
[null,""]
[null,""]
[null,""]
[null,""]
[null,""]
[null,""]
[null,""]
[null,""]
[null,""]
[null,""]
[null,""]
[null,""]
[null,""]
[null,""]
[null,""]
[null,""]
[null,""]
[null,""]
[null,""]
[null,""]
[null,""]
[null,""]
[null,""]
[null,""]
[null,""]
[null,""]
[null,""]
[null,""]
[null,""]
[null,""]
[null,""]
[null,""]
[null,""]
[null,""]
[null,""]
[null,""]
[null,""]
[null,""]
[null,""]
[null,""]
[null,""]
[null,""]
[null,""]
[null,""]
[null,""]
[null,""]
[null,""]
[null,""]
[null,""]
[null,""]
[null,""]
[null,""]
[null,""]
[null,""]
[null,""]
[null,""]
[null,{"$f":"IF(C333=\"\",\"\",B332+1)","v":""}]
[null,""]
[null,""]
[null,""]
[null,""]
[null,""]
[null,""]
[null,""]
[null,""]
[null,""]
[null,""]
[null,""]
[null,""]
[null,""]
[null,""]
[null,""]
[null,""]
[null,""]
[null,""]
[null,""]
[null,""]
[null,""]
[null,""]
[null,""]
[null,""]
[null,""]
[null,""]
[null,""]
[null,""]
[null,""]
[null,""]
[null,""]
[null,""]
[null,""]
[null,""]
[null,""]
[null,""]
[null,""]
[null,""]
[null,""]
[null,""]
[null,""]
[null,""]
[null,""]
[null,""]
[null,""]
[null,""]
[null,""]
[null,""]
[null,""]
[null,""]
[null,""]
[null,""]
[null,""]
[null,""]
[null,""]
[null,""]
[null,""]
[null,""]
[null,""]
[null,""]
[null,""]
[null,""]
[null,""]
[null,{"$f":"IF(C397=\"\",\"\",B396+1)","v":""}]
[null,""]
[null,""]
[null,""]
[null,""]
[null,""]
[null,""]
[null,""]
[null,""]
[null,""]
[null,""]
[null,""]
[null,""]
[null,""]
[null,""]
[null,""]
[null,""]
[null,""]
[null,""]
[null,""]
[null,""]
[null,""]
[null,""]
[null,""]
[null,""]
[null,""]
[null,""]
[null,""]
[null,""]
[null,""]
[null,""]
[null,""]
[null,""]
[null,""]
[null,""]
[null,""]
[null,""]
[null,""]
[null,""]
[null,""]
[null,""]
[null,""]
[null,""]
[null,""]
[null,""]
[null,""]
[null,""]
[null,""]
[null,""]
[null,""]
[null,""]
[null,""]
[null,""]
[null,""]
[null,""]
[null,""]
[null,""]
[null,""]
[null,""]
[null,""]
[null,""]
[null,""]
[null,""]
[null,""]
[null,{"$f":"IF(C461=\"\",\"\",B460+1)","v":""}]
[null,""]
[null,""]
[null,""]
[null,""]
[null,""]
[null,""]
[null,""]
[null,""]
[null,""]
[null,""]
[null,""]
[null,""]
[null,""]
[null,""]
[null,""]
[null,""]
[null,""]
[null,""]
[null,""]
[null,""]
[null,""]
[null,""]
[null,""]
[null,""]
[null,""]
[null,""]
[null,""]
[null,""]
[null,""]
[null,""]
[null,""]
[null,""]
[null,""]
[null,""]
[null,""]
[null,""]
[null,""]
[null,""]
[null,""]
[null,""]
[null,""]
[null,""]
[null,""]
[null,""]
[null,""]
[null,""]
[null,""]
[null,""]
[null,""]
[]
[null,null,null,null,null,null,null,null,null,null,null,null,null,null,null,null,null,null,null,null,null,null,null,null,null,null,null,null,null,null,null,null,null,null,"Totais pagas",{"$f":"SUM(AJ11:AJ510)","v":0},{"$f":"SUM(AK11:AK510)","v":0},0,0,0,{"$f":"SUM(AO11:AO510)","v":0}]

{"sheet":"Guia 3","index":2,"n_rows":512,"n_cols":46,"rows_kept":512,"cut":false,"hidden":true,"merged":[[4,2,4,8],[5,4,5,7],[6,2,6,5],[6,6,6,9],[6,10,6,11],[7,19,8,19],[6,15,6,22],[6,23,6,34],[6,35,6,45],[7,2,8,2],[7,3,8,3],[7,4,8,4],[7,5,8,5],[7,6,8,6],[7,7,8,7],[7,8,8,8],[6,14,8,14],[7,9,8,9],[7,10,8,10],[7,11,8,11],[7,12,8,12],[7,13,8,13],[7,15,8,15],[7,16,8,16],[7,17,8,17],[7,18,8,18],[7,35,7,40],[7,41,7,43],[7,44,7,45],[7,20,8,20],[7,21,8,21],[7,22,8,22],[7,23,7,28],[7,29,7,31],[7,32,7,34]]}
[]
[null,null,"Superior Tribunal de Justiça"]
[null,null,"Secretaria de Processamento de Feitos"]
[null,null,"Coordenadoria de Processamento de Feitos em Execução Judicial"]
[null,null,{"$f":"\"Relação das Requisições de Pequeno Valor - RPV pagas pelo STJ em \"&IF(F11=\"\",\"\",UPPER((TEXT(F11,\"mmmm/aaaa\"))))","v":"Relação das Requisições de Pequeno Valor - RPV pagas pelo STJ em "}]
[]
[null,null,"RPV",null,null,null,"P R O C E S S O     D E     O R I G E M",null,null,null,"E N T I D A D E S",null,"R E Q U E R E N T E","A D V O G A D O","Natureza do crédito","I N D I C A D O R E S",null,null,null,null,null,null,null,"VALORES REQUISITADOS",null,null,null,null,null,null,null,null,null,null,null,"VALORES ATUALIZADOS PARA PAGAMENTO"]
[null,null,"Nº","Registro","Autuada em","data do pgto","Ação","Autuada em","Tipo de causa","Trânsito","Entidade devedora","Órgão de origem","Origem do crédito","Origem do crédito",null,"Tributário","EC 94 2016","Lei 13.463 2017","PRC/RPV de origem","Nº DA GRU","DOENÇA GRAVE","Deficiência física","Isento de IR","Beneficiários",null,null,null,null,null,"PSSS",null,null,"R R A",null,null,"Beneficiários",null,null,null,null,null,"P S S S",null,null,"R R A"]
[null,null,null,null,null,null,null,null,null,null,null,null,null,null,null,null,null,null,null,null,null,null,null,"Total","Adv I","Adv II","Adv III","Adv IV","Requerente","Base","Desc","Patronal","NMA","Exercícios anteriores","Desconto","Total","Adv I","Adv II","Adv III","Adv IV","Reqte","BASE desc","Desc","Patronal","Exercícios anteriores","Dedução"]
[]
[null,{"$f":"IF(C11=\"\",\"\",1)","v":""}]
[null,{"$f":"IF(C12=\"\",\"\",B11+1)","v":""}]
[null,{"$f":"IF(C13=\"\",\"\",B12+1)","v":""}]
[null,""]
[null,""]
[null,""]
[null,""]
[null,""]
[null,""]
[null,""]
[null,""]
[null,""]
[null,""]
[null,""]
[null,""]
[null,""]
[null,""]
[null,""]
[null,""]
[null,""]
[null,""]
[null,""]
[null,""]
[null,""]
[null,""]
[null,""]
[null,""]
[null,""]
[null,""]
[null,""]
[null,""]
[null,""]
[null,""]
[null,""]
[null,""]
[null,""]
[null,""]
[null,""]
[null,""]
[null,""]
[null,""]
[null,""]
[null,""]
[null,""]
[null,""]
[null,""]
[null,""]
[null,""]
[null,""]
[null,""]
[null,""]
[null,""]
[null,""]
[null,""]
[null,""]
[null,""]
[null,""]
[null,""]
[null,""]
[null,""]
[null,""]
[null,""]
[null,""]
[null,""]
[null,""]
[null,""]
[null,{"$f":"IF(C77=\"\",\"\",B76+1)","v":""}]
[null,""]
[null,""]
[null,""]
[null,""]
[null,""]
[null,""]
[null,""]
[null,""]
[null,""]
[null,""]
[null,""]
[null,""]
[null,""]
[null,""]
[null,""]
[null,""]
[null,""]
[null,""]
[null,""]
[null,""]
[null,""]
[null,""]
[null,""]
[null,""]
[null,""]
[null,""]
[null,""]
[null,""]
[null,""]
[null,""]
[null,""]
[null,""]
[null,""]
[null,""]
[null,""]
[null,""]
[null,""]
[null,""]
[null,""]
[null,""]
[null,""]
[null,""]
[null,""]
[null,""]
[null,""]
[null,""]
[null,""]
[null,""]
[null,""]
[null,""]
[null,""]
[null,""]
[null,""]
[null,""]
[null,""]
[null,""]
[null,""]
[null,""]
[null,""]
[null,""]
[null,""]
[null,""]
[null,""]
[null,{"$f":"IF(C141=\"\",\"\",B140+1)","v":""}]
[null,""]
[null,""]
[null,""]
[null,""]
[null,""]
[null,""]
[null,""]
[null,""]
[null,""]
[null,""]
[null,""]
[null,""]
[null,""]
[null,""]
[null,""]
[null,""]
[null,""]
[null,""]
[null,""]
[null,""]
[null,""]
[null,""]
[null,""]
[null,""]
[null,""]
[null,""]
[null,""]
[null,""]
[null,""]
[null,""]
[null,""]
[null,""]
[null,""]
[null,""]
[null,""]
[null,""]
[null,""]
[null,""]
[null,""]
[null,""]
[null,""]
[null,""]
[null,""]
[null,""]
[null,""]
[null,""]
[null,""]
[null,""]
[null,""]
[null,""]
[null,""]
[null,""]
[null,""]
[null,""]
[null,""]
[null,""]
[null,""]
[null,""]
[null,""]
[null,""]
[null,""]
[null,""]
[null,""]
[null,{"$f":"IF(C205=\"\",\"\",B204+1)","v":""}]
[null,""]
[null,""]
[null,""]
[null,""]
[null,""]
[null,""]
[null,""]
[null,""]
[null,""]
[null,""]
[null,""]
[null,""]
[null,""]
[null,""]
[null,""]
[null,""]
[null,""]
[null,""]
[null,""]
[null,""]
[null,""]
[null,""]
[null,""]
[null,""]
[null,""]
[null,""]
[null,""]
[null,""]
[null,""]
[null,""]
[null,""]
[null,""]
[null,""]
[null,""]
[null,""]
[null,""]
[null,""]
[null,""]
[null,""]
[null,""]
[null,""]
[null,""]
[null,""]
[null,""]
[null,""]
[null,""]
[null,""]
[null,""]
[null,""]
[null,""]
[null,""]
[null,""]
[null,""]
[null,""]
[null,""]
[null,""]
[null,""]
[null,""]
[null,""]
[null,""]
[null,""]
[null,""]
[null,""]
[null,{"$f":"IF(C269=\"\",\"\",B268+1)","v":""}]
[null,""]
[null,""]
[null,""]
[null,""]
[null,""]
[null,""]
[null,""]
[null,""]
[null,""]
[null,""]
[null,""]
[null,""]
[null,""]
[null,""]
[null,""]
[null,""]
[null,""]
[null,""]
[null,""]
[null,""]
[null,""]
[null,""]
[null,""]
[null,""]
[null,""]
[null,""]
[null,""]
[null,""]
[null,""]
[null,""]
[null,""]
[null,""]
[null,""]
[null,""]
[null,""]
[null,""]
[null,""]
[null,""]
[null,""]
[null,""]
[null,""]
[null,""]
[null,""]
[null,""]
[null,""]
[null,""]
[null,""]
[null,""]
[null,""]
[null,""]
[null,""]
[null,""]
[null,""]
[null,""]
[null,""]
[null,""]
[null,""]
[null,""]
[null,""]
[null,""]
[null,""]
[null,""]
[null,""]
[null,{"$f":"IF(C333=\"\",\"\",B332+1)","v":""}]
[null,""]
[null,""]
[null,""]
[null,""]
[null,""]
[null,""]
[null,""]
[null,""]
[null,""]
[null,""]
[null,""]
[null,""]
[null,""]
[null,""]
[null,""]
[null,""]
[null,""]
[null,""]
[null,""]
[null,""]
[null,""]
[null,""]
[null,""]
[null,""]
[null,""]
[null,""]
[null,""]
[null,""]
[null,""]
[null,""]
[null,""]
[null,""]
[null,""]
[null,""]
[null,""]
[null,""]
[null,""]
[null,""]
[null,""]
[null,""]
[null,""]
[null,""]
[null,""]
[null,""]
[null,""]
[null,""]
[null,""]
[null,""]
[null,""]
[null,""]
[null,""]
[null,""]
[null,""]
[null,""]
[null,""]
[null,""]
[null,""]
[null,""]
[null,""]
[null,""]
[null,""]
[null,""]
[null,""]
[null,{"$f":"IF(C397=\"\",\"\",B396+1)","v":""}]
[null,""]
[null,""]
[null,""]
[null,""]
[null,""]
[null,""]
[null,""]
[null,""]
[null,""]
[null,""]
[null,""]
[null,""]
[null,""]
[null,""]
[null,""]
[null,""]
[null,""]
[null,""]
[null,""]
[null,""]
[null,""]
[null,""]
[null,""]
[null,""]
[null,""]
[null,""]
[null,""]
[null,""]
[null,""]
[null,""]
[null,""]
[null,""]
[null,""]
[null,""]
[null,""]
[null,""]
[null,""]
[null,""]
[null,""]
[null,""]
[null,""]
[null,""]
[null,""]
[null,""]
[null,""]
[null,""]
[null,""]
[null,""]
[null,""]
[null,""]
[null,""]
[null,""]
[null,""]
[null,""]
[null,""]
[null,""]
[null,""]
[null,""]
[null,""]
[null,""]
[null,""]
[null,""]
[null,""]
[null,{"$f":"IF(C461=\"\",\"\",B460+1)","v":""}]
[null,""]
[null,""]
[null,""]
[null,""]
[null,""]
[null,""]
[null,""]
[null,""]
[null,""]
[null,""]
[null,""]
[null,""]
[null,""]
[null,""]
[null,""]
[null,""]
[null,""]
[null,""]
[null,""]
[null,""]
[null,""]
[null,""]
[null,""]
[null,""]
[null,""]
[null,""]
[null,""]
[null,""]
[null,""]
[null,""]
[null,""]
[null,""]
[null,""]
[null,""]
[null,""]
[null,""]
[null,""]
[null,""]
[null,""]
[null,""]
[null,""]
[null,""]
[null,""]
[null,""]
[null,""]
[null,""]
[null,""]
[null,""]
[null,""]
[]
[null,null,null,null,null,null,null,null,null,null,null,null,null,null,null,null,null,null,null,null,null,null,null,null,null,null,null,null,null,null,null,null,null,null,"Totais pagas",{"$f":"SUM(AJ11:AJ510)","v":0},{"$f":"SUM(AK11:AK510)","v":0},0,0,0,{"$f":"SUM(AO11:AO510)","v":0}]

{"sheet":"Guia 4","index":3,"n_rows":512,"n_cols":46,"rows_kept":512,"cut":false,"hidden":true,"merged":[[4,2,4,8],[5,4,5,7],[6,2,6,5],[6,6,6,9],[6,10,6,11],[7,19,8,19],[6,15,6,22],[6,23,6,34],[6,35,6,45],[7,2,8,2],[7,3,8,3],[7,4,8,4],[7,5,8,5],[7,6,8,6],[7,7,8,7],[7,8,8,8],[6,14,8,14],[7,9,8,9],[7,10,8,10],[7,11,8,11],[7,12,8,12],[7,13,8,13],[7,15,8,15],[7,16,8,16],[7,17,8,17],[7,18,8,18],[7,35,7,40],[7,41,7,43],[7,44,7,45],[7,20,8,20],[7,21,8,21],[7,22,8,22],[7,23,7,28],[7,29,7,31],[7,32,7,34]]}
[]
[null,null,"Superior Tribunal de Justiça"]
[null,null,"Secretaria de Processamento de Feitos"]
[null,null,"Coordenadoria de Processamento de Feitos em Execução Judicial"]
[null,null,{"$f":"\"Relação das Requisições de Pequeno Valor - RPV pagas pelo STJ em \"&IF(F11=\"\",\"\",UPPER((TEXT(F11,\"mmmm/aaaa\"))))","v":"Relação das Requisições de Pequeno Valor - RPV pagas pelo STJ em "}]
[]
[null,null,"RPV",null,null,null,"P R O C E S S O     D E     O R I G E M",null,null,null,"E N T I D A D E S",null,"R E Q U E R E N T E","A D V O G A D O","Natureza do crédito","I N D I C A D O R E S",null,null,null,null,null,null,null,"VALORES REQUISITADOS",null,null,null,null,null,null,null,null,null,null,null,"VALORES ATUALIZADOS PARA PAGAMENTO"]
[null,null,"Nº","Registro","Autuada em","data do pgto","Ação","Autuada em","Tipo de causa","Trânsito","Entidade devedora","Órgão de origem","Origem do crédito","Origem do crédito",null,"Tributário","EC 94 2016","Lei 13.463 2017","PRC/RPV de origem","Nº DA GRU","DOENÇA GRAVE","Deficiência física","Isento de IR","Beneficiários",null,null,null,null,null,"PSSS",null,null,"R R A",null,null,"Beneficiários",null,null,null,null,null,"P S S S",null,null,"R R A"]
[null,null,null,null,null,null,null,null,null,null,null,null,null,null,null,null,null,null,null,null,null,null,null,"Total","Adv I","Adv II","Adv III","Adv IV","Requerente","Base","Desc","Patronal","NMA","Exercícios anteriores","Desconto","Total","Adv I","Adv II","Adv III","Adv IV","Reqte","BASE desc","Desc","Patronal","Exercícios anteriores","Dedução"]
[]
[null,{"$f":"IF(C11=\"\",\"\",1)","v":""}]
[null,{"$f":"IF(C12=\"\",\"\",B11+1)","v":""}]
[null,{"$f":"IF(C13=\"\",\"\",B12+1)","v":""}]
[null,""]
[null,""]
[null,""]
[null,""]
[null,""]
[null,""]
[null,""]
[null,""]
[null,""]
[null,""]
[null,""]
[null,""]
[null,""]
[null,""]
[null,""]
[null,""]
[null,""]
[null,""]
[null,""]
[null,""]
[null,""]
[null,""]
[null,""]
[null,""]
[null,""]
[null,""]
[null,""]
[null,""]
[null,""]
[null,""]
[null,""]
[null,""]
[null,""]
[null,""]
[null,""]
[null,""]
[null,""]
[null,""]
[null,""]
[null,""]
[null,""]
[null,""]
[null,""]
[null,""]
[null,""]
[null,""]
[null,""]
[null,""]
[null,""]
[null,""]
[null,""]
[null,""]
[null,""]
[null,""]
[null,""]
[null,""]
[null,""]
[null,""]
[null,""]
[null,""]
[null,""]
[null,""]
[null,""]
[null,{"$f":"IF(C77=\"\",\"\",B76+1)","v":""}]
[null,""]
[null,""]
[null,""]
[null,""]
[null,""]
[null,""]
[null,""]
[null,""]
[null,""]
[null,""]
[null,""]
[null,""]
[null,""]
[null,""]
[null,""]
[null,""]
[null,""]
[null,""]
[null,""]
[null,""]
[null,""]
[null,""]
[null,""]
[null,""]
[null,""]
[null,""]
[null,""]
[null,""]
[null,""]
[null,""]
[null,""]
[null,""]
[null,""]
[null,""]
[null,""]
[null,""]
[null,""]
[null,""]
[null,""]
[null,""]
[null,""]
[null,""]
[null,""]
[null,""]
[null,""]
[null,""]
[null,""]
[null,""]
[null,""]
[null,""]
[null,""]
[null,""]
[null,""]
[null,""]
[null,""]
[null,""]
[null,""]
[null,""]
[null,""]
[null,""]
[null,""]
[null,""]
[null,""]
[null,{"$f":"IF(C141=\"\",\"\",B140+1)","v":""}]
[null,""]
[null,""]
[null,""]
[null,""]
[null,""]
[null,""]
[null,""]
[null,""]
[null,""]
[null,""]
[null,""]
[null,""]
[null,""]
[null,""]
[null,""]
[null,""]
[null,""]
[null,""]
[null,""]
[null,""]
[null,""]
[null,""]
[null,""]
[null,""]
[null,""]
[null,""]
[null,""]
[null,""]
[null,""]
[null,""]
[null,""]
[null,""]
[null,""]
[null,""]
[null,""]
[null,""]
[null,""]
[null,""]
[null,""]
[null,""]
[null,""]
[null,""]
[null,""]
[null,""]
[null,""]
[null,""]
[null,""]
[null,""]
[null,""]
[null,""]
[null,""]
[null,""]
[null,""]
[null,""]
[null,""]
[null,""]
[null,""]
[null,""]
[null,""]
[null,""]
[null,""]
[null,""]
[null,""]
[null,{"$f":"IF(C205=\"\",\"\",B204+1)","v":""}]
[null,""]
[null,""]
[null,""]
[null,""]
[null,""]
[null,""]
[null,""]
[null,""]
[null,""]
[null,""]
[null,""]
[null,""]
[null,""]
[null,""]
[null,""]
[null,""]
[null,""]
[null,""]
[null,""]
[null,""]
[null,""]
[null,""]
[null,""]
[null,""]
[null,""]
[null,""]
[null,""]
[null,""]
[null,""]
[null,""]
[null,""]
[null,""]
[null,""]
[null,""]
[null,""]
[null,""]
[null,""]
[null,""]
[null,""]
[null,""]
[null,""]
[null,""]
[null,""]
[null,""]
[null,""]
[null,""]
[null,""]
[null,""]
[null,""]
[null,""]
[null,""]
[null,""]
[null,""]
[null,""]
[null,""]
[null,""]
[null,""]
[null,""]
[null,""]
[null,""]
[null,""]
[null,""]
[null,""]
[null,{"$f":"IF(C269=\"\",\"\",B268+1)","v":""}]
[null,""]
[null,""]
[null,""]
[null,""]
[null,""]
[null,""]
[null,""]
[null,""]
[null,""]
[null,""]
[null,""]
[null,""]
[null,""]
[null,""]
[null,""]
[null,""]
[null,""]
[null,""]
[null,""]
[null,""]
[null,""]
[null,""]
[null,""]
[null,""]
[null,""]
[null,""]
[null,""]
[null,""]
[null,""]
[null,""]
[null,""]
[null,""]
[null,""]
[null,""]
[null,""]
[null,""]
[null,""]
[null,""]
[null,""]
[null,""]
[null,""]
[null,""]
[null,""]
[null,""]
[null,""]
[null,""]
[null,""]
[null,""]
[null,""]
[null,""]
[null,""]
[null,""]
[null,""]
[null,""]
[null,""]
[null,""]
[null,""]
[null,""]
[null,""]
[null,""]
[null,""]
[null,""]
[null,""]
[null,{"$f":"IF(C333=\"\",\"\",B332+1)","v":""}]
[null,""]
[null,""]
[null,""]
[null,""]
[null,""]
[null,""]
[null,""]
[null,""]
[null,""]
[null,""]
[null,""]
[null,""]
[null,""]
[null,""]
[null,""]
[null,""]
[null,""]
[null,""]
[null,""]
[null,""]
[null,""]
[null,""]
[null,""]
[null,""]
[null,""]
[null,""]
[null,""]
[null,""]
[null,""]
[null,""]
[null,""]
[null,""]
[null,""]
[null,""]
[null,""]
[null,""]
[null,""]
[null,""]
[null,""]
[null,""]
[null,""]
[null,""]
[null,""]
[null,""]
[null,""]
[null,""]
[null,""]
[null,""]
[null,""]
[null,""]
[null,""]
[null,""]
[null,""]
[null,""]
[null,""]
[null,""]
[null,""]
[null,""]
[null,""]
[null,""]
[null,""]
[null,""]
[null,""]
[null,{"$f":"IF(C397=\"\",\"\",B396+1)","v":""}]
[null,""]
[null,""]
[null,""]
[null,""]
[null,""]
[null,""]
[null,""]
[null,""]
[null,""]
[null,""]
[null,""]
[null,""]
[null,""]
[null,""]
[null,""]
[null,""]
[null,""]
[null,""]
[null,""]
[null,""]
[null,""]
[null,""]
[null,""]
[null,""]
[null,""]
[null,""]
[null,""]
[null,""]
[null,""]
[null,""]
[null,""]
[null,""]
[null,""]
[null,""]
[null,""]
[null,""]
[null,""]
[null,""]
[null,""]
[null,""]
[null,""]
[null,""]
[null,""]
[null,""]
[null,""]
[null,""]
[null,""]
[null,""]
[null,""]
[null,""]
[null,""]
[null,""]
[null,""]
[null,""]
[null,""]
[null,""]
[null,""]
[null,""]
[null,""]
[null,""]
[null,""]
[null,""]
[null,""]
[null,{"$f":"IF(C461=\"\",\"\",B460+1)","v":""}]
[null,""]
[null,""]
[null,""]
[null,""]
[null,""]
[null,""]
[null,""]
[null,""]
[null,""]
[null,""]
[null,""]
[null,""]
[null,""]
[null,""]
[null,""]
[null,""]
[null,""]
[null,""]
[null,""]
[null,""]
[null,""]
[null,""]
[null,""]
[null,""]
[null,""]
[null,""]
[null,""]
[null,""]
[null,""]
[null,""]
[null,""]
[null,""]
[null,""]
[null,""]
[null,""]
[null,""]
[null,""]
[null,""]
[null,""]
[null,""]
[null,""]
[null,""]
[null,""]
[null,""]
[null,""]
[null,""]
[null,""]
[null,""]
[null,""]
[]
[null,null,null,null,null,null,null,null,null,null,null,null,null,null,null,null,null,null,null,null,null,null,null,null,null,null,null,null,null,null,null,null,null,null,"Totais pagas",{"$f":"SUM(AJ11:AJ510)","v":0},{"$f":"SUM(AK11:AK510)","v":0},0,0,0,{"$f":"SUM(AO11:AO510)","v":0}]

{"sheet":"Guia 5","index":4,"n_rows":512,"n_cols":46,"rows_kept":512,"cut":false,"hidden":true,"merged":[[4,2,4,8],[5,4,5,7],[6,2,6,5],[6,6,6,9],[6,10,6,11],[7,19,8,19],[6,15,6,22],[6,23,6,34],[6,35,6,45],[7,2,8,2],[7,3,8,3],[7,4,8,4],[7,5,8,5],[7,6,8,6],[7,7,8,7],[7,8,8,8],[6,14,8,14],[7,9,8,9],[7,10,8,10],[7,11,8,11],[7,12,8,12],[7,13,8,13],[7,15,8,15],[7,16,8,16],[7,17,8,17],[7,18,8,18],[7,35,7,40],[7,41,7,43],[7,44,7,45],[7,20,8,20],[7,21,8,21],[7,22,8,22],[7,23,7,28],[7,29,7,31],[7,32,7,34]]}
[]
[null,null,"Superior Tribunal de Justiça"]
[null,null,"Secretaria de Processamento de Feitos"]
[null,null,"Coordenadoria de Processamento de Feitos em Execução Judicial"]
[null,null,{"$f":"\"Relação das Requisições de Pequeno Valor - RPV pagas pelo STJ em \"&IF(F11=\"\",\"\",UPPER((TEXT(F11,\"mmmm/aaaa\"))))","v":"Relação das Requisições de Pequeno Valor - RPV pagas pelo STJ em "}]
[]
[null,null,"RPV",null,null,null,"P R O C E S S O     D E     O R I G E M",null,null,null,"E N T I D A D E S",null,"R E Q U E R E N T E","A D V O G A D O","Natureza do crédito","I N D I C A D O R E S",null,null,null,null,null,null,null,"VALORES REQUISITADOS",null,null,null,null,null,null,null,null,null,null,null,"VALORES ATUALIZADOS PARA PAGAMENTO"]
[null,null,"Nº","Registro","Autuada em","data do pgto","Ação","Autuada em","Tipo de causa","Trânsito","Entidade devedora","Órgão de origem","Origem do crédito","Origem do crédito",null,"Tributário","EC 94 2016","Lei 13.463 2017","PRC/RPV de origem","Nº DA GRU","DOENÇA GRAVE","Deficiência física","Isento de IR","Beneficiários",null,null,null,null,null,"PSSS",null,null,"R R A",null,null,"Beneficiários",null,null,null,null,null,"P S S S",null,null,"R R A"]
[null,null,null,null,null,null,null,null,null,null,null,null,null,null,null,null,null,null,null,null,null,null,null,"Total","Adv I","Adv II","Adv III","Adv IV","Requerente","Base","Desc","Patronal","NMA","Exercícios anteriores","Desconto","Total","Adv I","Adv II","Adv III","Adv IV","Reqte","BASE desc","Desc","Patronal","Exercícios anteriores","Dedução"]
[]
[null,{"$f":"IF(C11=\"\",\"\",1)","v":""}]
[null,{"$f":"IF(C12=\"\",\"\",B11+1)","v":""}]
[null,{"$f":"IF(C13=\"\",\"\",B12+1)","v":""}]
[null,""]
[null,""]
[null,""]
[null,""]
[null,""]
[null,""]
[null,""]
[null,""]
[null,""]
[null,""]
[null,""]
[null,""]
[null,""]
[null,""]
[null,""]
[null,""]
[null,""]
[null,""]
[null,""]
[null,""]
[null,""]
[null,""]
[null,""]
[null,""]
[null,""]
[null,""]
[null,""]
[null,""]
[null,""]
[null,""]
[null,""]
[null,""]
[null,""]
[null,""]
[null,""]
[null,""]
[null,""]
[null,""]
[null,""]
[null,""]
[null,""]
[null,""]
[null,""]
[null,""]
[null,""]
[null,""]
[null,""]
[null,""]
[null,""]
[null,""]
[null,""]
[null,""]
[null,""]
[null,""]
[null,""]
[null,""]
[null,""]
[null,""]
[null,""]
[null,""]
[null,""]
[null,""]
[null,""]
[null,{"$f":"IF(C77=\"\",\"\",B76+1)","v":""}]
[null,""]
[null,""]
[null,""]
[null,""]
[null,""]
[null,""]
[null,""]
[null,""]
[null,""]
[null,""]
[null,""]
[null,""]
[null,""]
[null,""]
[null,""]
[null,""]
[null,""]
[null,""]
[null,""]
[null,""]
[null,""]
[null,""]
[null,""]
[null,""]
[null,""]
[null,""]
[null,""]
[null,""]
[null,""]
[null,""]
[null,""]
[null,""]
[null,""]
[null,""]
[null,""]
[null,""]
[null,""]
[null,""]
[null,""]
[null,""]
[null,""]
[null,""]
[null,""]
[null,""]
[null,""]
[null,""]
[null,""]
[null,""]
[null,""]
[null,""]
[null,""]
[null,""]
[null,""]
[null,""]
[null,""]
[null,""]
[null,""]
[null,""]
[null,""]
[null,""]
[null,""]
[null,""]
[null,""]
[null,{"$f":"IF(C141=\"\",\"\",B140+1)","v":""}]
[null,""]
[null,""]
[null,""]
[null,""]
[null,""]
[null,""]
[null,""]
[null,""]
[null,""]
[null,""]
[null,""]
[null,""]
[null,""]
[null,""]
[null,""]
[null,""]
[null,""]
[null,""]
[null,""]
[null,""]
[null,""]
[null,""]
[null,""]
[null,""]
[null,""]
[null,""]
[null,""]
[null,""]
[null,""]
[null,""]
[null,""]
[null,""]
[null,""]
[null,""]
[null,""]
[null,""]
[null,""]
[null,""]
[null,""]
[null,""]
[null,""]
[null,""]
[null,""]
[null,""]
[null,""]
[null,""]
[null,""]
[null,""]
[null,""]
[null,""]
[null,""]
[null,""]
[null,""]
[null,""]
[null,""]
[null,""]
[null,""]
[null,""]
[null,""]
[null,""]
[null,""]
[null,""]
[null,""]
[null,{"$f":"IF(C205=\"\",\"\",B204+1)","v":""}]
[null,""]
[null,""]
[null,""]
[null,""]
[null,""]
[null,""]
[null,""]
[null,""]
[null,""]
[null,""]
[null,""]
[null,""]
[null,""]
[null,""]
[null,""]
[null,""]
[null,""]
[null,""]
[null,""]
[null,""]
[null,""]
[null,""]
[null,""]
[null,""]
[null,""]
[null,""]
[null,""]
[null,""]
[null,""]
[null,""]
[null,""]
[null,""]
[null,""]
[null,""]
[null,""]
[null,""]
[null,""]
[null,""]
[null,""]
[null,""]
[null,""]
[null,""]
[null,""]
[null,""]
[null,""]
[null,""]
[null,""]
[null,""]
[null,""]
[null,""]
[null,""]
[null,""]
[null,""]
[null,""]
[null,""]
[null,""]
[null,""]
[null,""]
[null,""]
[null,""]
[null,""]
[null,""]
[null,""]
[null,{"$f":"IF(C269=\"\",\"\",B268+1)","v":""}]
[null,""]
[null,""]
[null,""]
[null,""]
[null,""]
[null,""]
[null,""]
[null,""]
[null,""]
[null,""]
[null,""]
[null,""]
[null,""]
[null,""]
[null,""]
[null,""]
[null,""]
[null,""]
[null,""]
[null,""]
[null,""]
[null,""]
[null,""]
[null,""]
[null,""]
[null,""]
[null,""]
[null,""]
[null,""]
[null,""]
[null,""]
[null,""]
[null,""]
[null,""]
[null,""]
[null,""]
[null,""]
[null,""]
[null,""]
[null,""]
[null,""]
[null,""]
[null,""]
[null,""]
[null,""]
[null,""]
[null,""]
[null,""]
[null,""]
[null,""]
[null,""]
[null,""]
[null,""]
[null,""]
[null,""]
[null,""]
[null,""]
[null,""]
[null,""]
[null,""]
[null,""]
[null,""]
[null,""]
[null,{"$f":"IF(C333=\"\",\"\",B332+1)","v":""}]
[null,""]
[null,""]
[null,""]
[null,""]
[null,""]
[null,""]
[null,""]
[null,""]
[null,""]
[null,""]
[null,""]
[null,""]
[null,""]
[null,""]
[null,""]
[null,""]
[null,""]
[null,""]
[null,""]
[null,""]
[null,""]
[null,""]
[null,""]
[null,""]
[null,""]
[null,""]
[null,""]
[null,""]
[null,""]
[null,""]
[null,""]
[null,""]
[null,""]
[null,""]
[null,""]
[null,""]
[null,""]
[null,""]
[null,""]
[null,""]
[null,""]
[null,""]
[null,""]
[null,""]
[null,""]
[null,""]
[null,""]
[null,""]
[null,""]
[null,""]
[null,""]
[null,""]
[null,""]
[null,""]
[null,""]
[null,""]
[null,""]
[null,""]
[null,""]
[null,""]
[null,""]
[null,""]
[null,""]
[null,{"$f":"IF(C397=\"\",\"\",B396+1)","v":""}]
[null,""]
[null,""]
[null,""]
[null,""]
[null,""]
[null,""]
[null,""]
[null,""]
[null,""]
[null,""]
[null,""]
[null,""]
[null,""]
[null,""]
[null,""]
[null,""]
[null,""]
[null,""]
[null,""]
[null,""]
[null,""]
[null,""]
[null,""]
[null,""]
[null,""]
[null,""]
[null,""]
[null,""]
[null,""]
[null,""]
[null,""]
[null,""]
[null,""]
[null,""]
[null,""]
[null,""]
[null,""]
[null,""]
[null,""]
[null,""]
[null,""]
[null,""]
[null,""]
[null,""]
[null,""]
[null,""]
[null,""]
[null,""]
[null,""]
[null,""]
[null,""]
[null,""]
[null,""]
[null,""]
[null,""]
[null,""]
[null,""]
[null,""]
[null,""]
[null,""]
[null,""]
[null,""]
[null,""]
[null,{"$f":"IF(C461=\"\",\"\",B460+1)","v":""}]
[null,""]
[null,""]
[null,""]
[null,""]
[null,""]
[null,""]
[null,""]
[null,""]
[null,""]
[null,""]
[null,""]
[null,""]
[null,""]
[null,""]
[null,""]
[null,""]
[null,""]
[null,""]
[null,""]
[null,""]
[null,""]
[null,""]
[null,""]
[null,""]
[null,""]
[null,""]
[null,""]
[null,""]
[null,""]
[null,""]
[null,""]
[null,""]
[null,""]
[null,""]
[null,""]
[null,""]
[null,""]
[null,""]
[null,""]
[null,""]
[null,""]
[null,""]
[null,""]
[null,""]
[null,""]
[null,""]
[null,""]
[null,""]
[null,""]
[]
[null,null,null,null,null,null,null,null,null,null,null,null,null,null,null,null,null,null,null,null,null,null,null,null,null,null,null,null,null,null,null,null,null,null,"Totais pagas",{"$f":"SUM(AJ11:AJ510)","v":0},{"$f":"SUM(AK11:AK510)","v":0},0,0,0,{"$f":"SUM(AO11:AO510)","v":0}]

{"sheet":"Guia 6","index":5,"n_rows":512,"n_cols":46,"rows_kept":512,"cut":false,"hidden":true,"merged":[[4,2,4,8],[5,4,5,7],[6,2,6,5],[6,6,6,9],[6,10,6,11],[7,19,8,19],[6,15,6,22],[6,23,6,34],[6,35,6,45],[7,2,8,2],[7,3,8,3],[7,4,8,4],[7,5,8,5],[7,6,8,6],[7,7,8,7],[7,8,8,8],[6,14,8,14],[7,9,8,9],[7,10,8,10],[7,11,8,11],[7,12,8,12],[7,13,8,13],[7,15,8,15],[7,16,8,16],[7,17,8,17],[7,18,8,18],[7,35,7,40],[7,41,7,43],[7,44,7,45],[7,20,8,20],[7,21,8,21],[7,22,8,22],[7,23,7,28],[7,29,7,31],[7,32,7,34]]}
[]
[null,null,"Superior Tribunal de Justiça"]
[null,null,"Secretaria de Processamento de Feitos"]
[null,null,"Coordenadoria de Processamento de Feitos em Execução Judicial"]
[null,null,{"$f":"\"Relação das Requisições de Pequeno Valor - RPV pagas pelo STJ em \"&IF(F11=\"\",\"\",UPPER((TEXT(F11,\"mmmm/aaaa\"))))","v":"Relação das Requisições de Pequeno Valor - RPV pagas pelo STJ em "}]
[]
[null,null,"RPV",null,null,null,"P R O C E S S O     D E     O R I G E M",null,null,null,"E N T I D A D E S",null,"R E Q U E R E N T E","A D V O G A D O","Natureza do crédito","I N D I C A D O R E S",null,null,null,null,null,null,null,"VALORES REQUISITADOS",null,null,null,null,null,null,null,null,null,null,null,"VALORES ATUALIZADOS PARA PAGAMENTO"]
[null,null,"Nº","Registro","Autuada em","data do pgto","Ação","Autuada em","Tipo de causa","Trânsito","Entidade devedora","Órgão de origem","Origem do crédito","Origem do crédito",null,"Tributário","EC 94 2016","Lei 13.463 2017","PRC/RPV de origem","Nº DA GRU","DOENÇA GRAVE","Deficiência física","Isento de IR","Beneficiários",null,null,null,null,null,"PSSS",null,null,"R R A",null,null,"Beneficiários",null,null,null,null,null,"P S S S",null,null,"R R A"]
[null,null,null,null,null,null,null,null,null,null,null,null,null,null,null,null,null,null,null,null,null,null,null,"Total","Adv I","Adv II","Adv III","Adv IV","Requerente","Base","Desc","Patronal","NMA","Exercícios anteriores","Desconto","Total","Adv I","Adv II","Adv III","Adv IV","Reqte","BASE desc","Desc","Patronal","Exercícios anteriores","Dedução"]
[]
[null,{"$f":"IF(C11=\"\",\"\",1)","v":""}]
[null,{"$f":"IF(C12=\"\",\"\",B11+1)","v":""}]
[null,{"$f":"IF(C13=\"\",\"\",B12+1)","v":""}]
[null,""]
[null,""]
[null,""]
[null,""]
[null,""]
[null,""]
[null,""]
[null,""]
[null,""]
[null,""]
[null,""]
[null,""]
[null,""]
[null,""]
[null,""]
[null,""]
[null,""]
[null,""]
[null,""]
[null,""]
[null,""]
[null,""]
[null,""]
[null,""]
[null,""]
[null,""]
[null,""]
[null,""]
[null,""]
[null,""]
[null,""]
[null,""]
[null,""]
[null,""]
[null,""]
[null,""]
[null,""]
[null,""]
[null,""]
[null,""]
[null,""]
[null,""]
[null,""]
[null,""]
[null,""]
[null,""]
[null,""]
[null,""]
[null,""]
[null,""]
[null,""]
[null,""]
[null,""]
[null,""]
[null,""]
[null,""]
[null,""]
[null,""]
[null,""]
[null,""]
[null,""]
[null,""]
[null,""]
[null,{"$f":"IF(C77=\"\",\"\",B76+1)","v":""}]
[null,""]
[null,""]
[null,""]
[null,""]
[null,""]
[null,""]
[null,""]
[null,""]
[null,""]
[null,""]
[null,""]
[null,""]
[null,""]
[null,""]
[null,""]
[null,""]
[null,""]
[null,""]
[null,""]
[null,""]
[null,""]
[null,""]
[null,""]
[null,""]
[null,""]
[null,""]
[null,""]
[null,""]
[null,""]
[null,""]
[null,""]
[null,""]
[null,""]
[null,""]
[null,""]
[null,""]
[null,""]
[null,""]
[null,""]
[null,""]
[null,""]
[null,""]
[null,""]
[null,""]
[null,""]
[null,""]
[null,""]
[null,""]
[null,""]
[null,""]
[null,""]
[null,""]
[null,""]
[null,""]
[null,""]
[null,""]
[null,""]
[null,""]
[null,""]
[null,""]
[null,""]
[null,""]
[null,""]
[null,{"$f":"IF(C141=\"\",\"\",B140+1)","v":""}]
[null,""]
[null,""]
[null,""]
[null,""]
[null,""]
[null,""]
[null,""]
[null,""]
[null,""]
[null,""]
[null,""]
[null,""]
[null,""]
[null,""]
[null,""]
[null,""]
[null,""]
[null,""]
[null,""]
[null,""]
[null,""]
[null,""]
[null,""]
[null,""]
[null,""]
[null,""]
[null,""]
[null,""]
[null,""]
[null,""]
[null,""]
[null,""]
[null,""]
[null,""]
[null,""]
[null,""]
[null,""]
[null,""]
[null,""]
[null,""]
[null,""]
[null,""]
[null,""]
[null,""]
[null,""]
[null,""]
[null,""]
[null,""]
[null,""]
[null,""]
[null,""]
[null,""]
[null,""]
[null,""]
[null,""]
[null,""]
[null,""]
[null,""]
[null,""]
[null,""]
[null,""]
[null,""]
[null,""]
[null,{"$f":"IF(C205=\"\",\"\",B204+1)","v":""}]
[null,""]
[null,""]
[null,""]
[null,""]
[null,""]
[null,""]
[null,""]
[null,""]
[null,""]
[null,""]
[null,""]
[null,""]
[null,""]
[null,""]
[null,""]
[null,""]
[null,""]
[null,""]
[null,""]
[null,""]
[null,""]
[null,""]
[null,""]
[null,""]
[null,""]
[null,""]
[null,""]
[null,""]
[null,""]
[null,""]
[null,""]
[null,""]
[null,""]
[null,""]
[null,""]
[null,""]
[null,""]
[null,""]
[null,""]
[null,""]
[null,""]
[null,""]
[null,""]
[null,""]
[null,""]
[null,""]
[null,""]
[null,""]
[null,""]
[null,""]
[null,""]
[null,""]
[null,""]
[null,""]
[null,""]
[null,""]
[null,""]
[null,""]
[null,""]
[null,""]
[null,""]
[null,""]
[null,""]
[null,{"$f":"IF(C269=\"\",\"\",B268+1)","v":""}]
[null,""]
[null,""]
[null,""]
[null,""]
[null,""]
[null,""]
[null,""]
[null,""]
[null,""]
[null,""]
[null,""]
[null,""]
[null,""]
[null,""]
[null,""]
[null,""]
[null,""]
[null,""]
[null,""]
[null,""]
[null,""]
[null,""]
[null,""]
[null,""]
[null,""]
[null,""]
[null,""]
[null,""]
[null,""]
[null,""]
[null,""]
[null,""]
[null,""]
[null,""]
[null,""]
[null,""]
[null,""]
[null,""]
[null,""]
[null,""]
[null,""]
[null,""]
[null,""]
[null,""]
[null,""]
[null,""]
[null,""]
[null,""]
[null,""]
[null,""]
[null,""]
[null,""]
[null,""]
[null,""]
[null,""]
[null,""]
[null,""]
[null,""]
[null,""]
[null,""]
[null,""]
[null,""]
[null,""]
[null,{"$f":"IF(C333=\"\",\"\",B332+1)","v":""}]
[null,""]
[null,""]
[null,""]
[null,""]
[null,""]
[null,""]
[null,""]
[null,""]
[null,""]
[null,""]
[null,""]
[null,""]
[null,""]
[null,""]
[null,""]
[null,""]
[null,""]
[null,""]
[null,""]
[null,""]
[null,""]
[null,""]
[null,""]
[null,""]
[null,""]
[null,""]
[null,""]
[null,""]
[null,""]
[null,""]
[null,""]
[null,""]
[null,""]
[null,""]
[null,""]
[null,""]
[null,""]
[null,""]
[null,""]
[null,""]
[null,""]
[null,""]
[null,""]
[null,""]
[null,""]
[null,""]
[null,""]
[null,""]
[null,""]
[null,""]
[null,""]
[null,""]
[null,""]
[null,""]
[null,""]
[null,""]
[null,""]
[null,""]
[null,""]
[null,""]
[null,""]
[null,""]
[null,""]
[null,{"$f":"IF(C397=\"\",\"\",B396+1)","v":""}]
[null,""]
[null,""]
[null,""]
[null,""]
[null,""]
[null,""]
[null,""]
[null,""]
[null,""]
[null,""]
[null,""]
[null,""]
[null,""]
[null,""]
[null,""]
[null,""]
[null,""]
[null,""]
[null,""]
[null,""]
[null,""]
[null,""]
[null,""]
[null,""]
[null,""]
[null,""]
[null,""]
[null,""]
[null,""]
[null,""]
[null,""]
[null,""]
[null,""]
[null,""]
[null,""]
[null,""]
[null,""]
[null,""]
[null,""]
[null,""]
[null,""]
[null,""]
[null,""]
[null,""]
[null,""]
[null,""]
[null,""]
[null,""]
[null,""]
[null,""]
[null,""]
[null,""]
[null,""]
[null,""]
[null,""]
[null,""]
[null,""]
[null,""]
[null,""]
[null,""]
[null,""]
[null,""]
[null,""]
[null,{"$f":"IF(C461=\"\",\"\",B460+1)","v":""}]
[null,""]
[null,""]
[null,""]
[null,""]
[null,""]
[null,""]
[null,""]
[null,""]
[null,""]
[null,""]
[null,""]
[null,""]
[null,""]
[null,""]
[null,""]
[null,""]
[null,""]
[null,""]
[null,""]
[null,""]
[null,""]
[null,""]
[null,""]
[null,""]
[null,""]
[null,""]
[null,""]
[null,""]
[null,""]
[null,""]
[null,""]
[null,""]
[null,""]
[null,""]
[null,""]
[null,""]
[null,""]
[null,""]
[null,""]
[null,""]
[null,""]
[null,""]
[null,""]
[null,""]
[null,""]
[null,""]
[null,""]
[null,""]
[null,""]
[]
[null,null,null,null,null,null,null,null,null,null,null,null,null,null,null,null,null,null,null,null,null,null,null,null,null,null,null,null,null,null,null,null,null,null,"Totais pagas",{"$f":"SUM(AJ11:AJ510)","v":0},{"$f":"SUM(AK11:AK510)","v":0},0,0,0,{"$f":"SUM(AO11:AO510)","v":0}]

{"sheet":"Guia 7","index":6,"n_rows":512,"n_cols":46,"rows_kept":512,"cut":false,"hidden":true,"merged":[[4,2,4,8],[5,4,5,7],[6,2,6,5],[6,6,6,9],[6,10,6,11],[7,19,8,19],[6,15,6,22],[6,23,6,34],[6,35,6,45],[7,2,8,2],[7,3,8,3],[7,4,8,4],[7,5,8,5],[7,6,8,6],[7,7,8,7],[7,8,8,8],[6,14,8,14],[7,9,8,9],[7,10,8,10],[7,11,8,11],[7,12,8,12],[7,13,8,13],[7,15,8,15],[7,16,8,16],[7,17,8,17],[7,18,8,18],[7,35,7,40],[7,41,7,43],[7,44,7,45],[7,20,8,20],[7,21,8,21],[7,22,8,22],[7,23,7,28],[7,29,7,31],[7,32,7,34]]}
[]
[null,null,"Superior Tribunal de Justiça"]
[null,null,"Secretaria de Processamento de Feitos"]
[null,null,"Coordenadoria de Processamento de Feitos em Execução Judicial"]
[null,null,{"$f":"\"Relação das Requisições de Pequeno Valor - RPV pagas pelo STJ em \"&IF(F11=\"\",\"\",UPPER((TEXT(F11,\"mmmm/aaaa\"))))","v":"Relação das Requisições de Pequeno Valor - RPV pagas pelo STJ em "}]
[]
[null,null,"RPV",null,null,null,"P R O C E S S O     D E     O R I G E M",null,null,null,"E N T I D A D E S",null,"R E Q U E R E N T E","A D V O G A D O","Natureza do crédito","I N D I C A D O R E S",null,null,null,null,null,null,null,"VALORES REQUISITADOS",null,null,null,null,null,null,null,null,null,null,null,"VALORES ATUALIZADOS PARA PAGAMENTO"]
[null,null,"Nº","Registro","Autuada em","data do pgto","Ação","Autuada em","Tipo de causa","Trânsito","Entidade devedora","Órgão de origem","Origem do crédito","Origem do crédito",null,"Tributário","EC 94 2016","Lei 13.463 2017","PRC/RPV de origem","Nº DA GRU","DOENÇA GRAVE","Deficiência física","Isento de IR","Beneficiários",null,null,null,null,null,"PSSS",null,null,"R R A",null,null,"Beneficiários",null,null,null,null,null,"P S S S",null,null,"R R A"]
[null,null,null,null,null,null,null,null,null,null,null,null,null,null,null,null,null,null,null,null,null,null,null,"Total","Adv I","Adv II","Adv III","Adv IV","Requerente","Base","Desc","Patronal","NMA","Exercícios anteriores","Desconto","Total","Adv I","Adv II","Adv III","Adv IV","Reqte","BASE desc","Desc","Patronal","Exercícios anteriores","Dedução"]
[]
[null,{"$f":"IF(C11=\"\",\"\",1)","v":""}]
[null,{"$f":"IF(C12=\"\",\"\",B11+1)","v":""}]
[null,{"$f":"IF(C13=\"\",\"\",B12+1)","v":""}]
[null,""]
[null,""]
[null,""]
[null,""]
[null,""]
[null,""]
[null,""]
[null,""]
[null,""]
[null,""]
[null,""]
[null,""]
[null,""]
[null,""]
[null,""]
[null,""]
[null,""]
[null,""]
[null,""]
[null,""]
[null,""]
[null,""]
[null,""]
[null,""]
[null,""]
[null,""]
[null,""]
[null,""]
[null,""]
[null,""]
[null,""]
[null,""]
[null,""]
[null,""]
[null,""]
[null,""]
[null,""]
[null,""]
[null,""]
[null,""]
[null,""]
[null,""]
[null,""]
[null,""]
[null,""]
[null,""]
[null,""]
[null,""]
[null,""]
[null,""]
[null,""]
[null,""]
[null,""]
[null,""]
[null,""]
[null,""]
[null,""]
[null,""]
[null,""]
[null,""]
[null,""]
[null,""]
[null,""]
[null,{"$f":"IF(C77=\"\",\"\",B76+1)","v":""}]
[null,""]
[null,""]
[null,""]
[null,""]
[null,""]
[null,""]
[null,""]
[null,""]
[null,""]
[null,""]
[null,""]
[null,""]
[null,""]
[null,""]
[null,""]
[null,""]
[null,""]
[null,""]
[null,""]
[null,""]
[null,""]
[null,""]
[null,""]
[null,""]
[null,""]
[null,""]
[null,""]
[null,""]
[null,""]
[null,""]
[null,""]
[null,""]
[null,""]
[null,""]
[null,""]
[null,""]
[null,""]
[null,""]
[null,""]
[null,""]
[null,""]
[null,""]
[null,""]
[null,""]
[null,""]
[null,""]
[null,""]
[null,""]
[null,""]
[null,""]
[null,""]
[null,""]
[null,""]
[null,""]
[null,""]
[null,""]
[null,""]
[null,""]
[null,""]
[null,""]
[null,""]
[null,""]
[null,""]
[null,{"$f":"IF(C141=\"\",\"\",B140+1)","v":""}]
[null,""]
[null,""]
[null,""]
[null,""]
[null,""]
[null,""]
[null,""]
[null,""]
[null,""]
[null,""]
[null,""]
[null,""]
[null,""]
[null,""]
[null,""]
[null,""]
[null,""]
[null,""]
[null,""]
[null,""]
[null,""]
[null,""]
[null,""]
[null,""]
[null,""]
[null,""]
[null,""]
[null,""]
[null,""]
[null,""]
[null,""]
[null,""]
[null,""]
[null,""]
[null,""]
[null,""]
[null,""]
[null,""]
[null,""]
[null,""]
[null,""]
[null,""]
[null,""]
[null,""]
[null,""]
[null,""]
[null,""]
[null,""]
[null,""]
[null,""]
[null,""]
[null,""]
[null,""]
[null,""]
[null,""]
[null,""]
[null,""]
[null,""]
[null,""]
[null,""]
[null,""]
[null,""]
[null,""]
[null,{"$f":"IF(C205=\"\",\"\",B204+1)","v":""}]
[null,""]
[null,""]
[null,""]
[null,""]
[null,""]
[null,""]
[null,""]
[null,""]
[null,""]
[null,""]
[null,""]
[null,""]
[null,""]
[null,""]
[null,""]
[null,""]
[null,""]
[null,""]
[null,""]
[null,""]
[null,""]
[null,""]
[null,""]
[null,""]
[null,""]
[null,""]
[null,""]
[null,""]
[null,""]
[null,""]
[null,""]
[null,""]
[null,""]
[null,""]
[null,""]
[null,""]
[null,""]
[null,""]
[null,""]
[null,""]
[null,""]
[null,""]
[null,""]
[null,""]
[null,""]
[null,""]
[null,""]
[null,""]
[null,""]
[null,""]
[null,""]
[null,""]
[null,""]
[null,""]
[null,""]
[null,""]
[null,""]
[null,""]
[null,""]
[null,""]
[null,""]
[null,""]
[null,""]
[null,{"$f":"IF(C269=\"\",\"\",B268+1)","v":""}]
[null,""]
[null,""]
[null,""]
[null,""]
[null,""]
[null,""]
[null,""]
[null,""]
[null,""]
[null,""]
[null,""]
[null,""]
[null,""]
[null,""]
[null,""]
[null,""]
[null,""]
[null,""]
[null,""]
[null,""]
[null,""]
[null,""]
[null,""]
[null,""]
[null,""]
[null,""]
[null,""]
[null,""]
[null,""]
[null,""]
[null,""]
[null,""]
[null,""]
[null,""]
[null,""]
[null,""]
[null,""]
[null,""]
[null,""]
[null,""]
[null,""]
[null,""]
[null,""]
[null,""]
[null,""]
[null,""]
[null,""]
[null,""]
[null,""]
[null,""]
[null,""]
[null,""]
[null,""]
[null,""]
[null,""]
[null,""]
[null,""]
[null,""]
[null,""]
[null,""]
[null,""]
[null,""]
[null,""]
[null,{"$f":"IF(C333=\"\",\"\",B332+1)","v":""}]
[null,""]
[null,""]
[null,""]
[null,""]
[null,""]
[null,""]
[null,""]
[null,""]
[null,""]
[null,""]
[null,""]
[null,""]
[null,""]
[null,""]
[null,""]
[null,""]
[null,""]
[null,""]
[null,""]
[null,""]
[null,""]
[null,""]
[null,""]
[null,""]
[null,""]
[null,""]
[null,""]
[null,""]
[null,""]
[null,""]
[null,""]
[null,""]
[null,""]
[null,""]
[null,""]
[null,""]
[null,""]
[null,""]
[null,""]
[null,""]
[null,""]
[null,""]
[null,""]
[null,""]
[null,""]
[null,""]
[null,""]
[null,""]
[null,""]
[null,""]
[null,""]
[null,""]
[null,""]
[null,""]
[null,""]
[null,""]
[null,""]
[null,""]
[null,""]
[null,""]
[null,""]
[null,""]
[null,""]
[null,{"$f":"IF(C397=\"\",\"\",B396+1)","v":""}]
[null,""]
[null,""]
[null,""]
[null,""]
[null,""]
[null,""]
[null,""]
[null,""]
[null,""]
[null,""]
[null,""]
[null,""]
[null,""]
[null,""]
[null,""]
[null,""]
[null,""]
[null,""]
[null,""]
[null,""]
[null,""]
[null,""]
[null,""]
[null,""]
[null,""]
[null,""]
[null,""]
[null,""]
[null,""]
[null,""]
[null,""]
[null,""]
[null,""]
[null,""]
[null,""]
[null,""]
[null,""]
[null,""]
[null,""]
[null,""]
[null,""]
[null,""]
[null,""]
[null,""]
[null,""]
[null,""]
[null,""]
[null,""]
[null,""]
[null,""]
[null,""]
[null,""]
[null,""]
[null,""]
[null,""]
[null,""]
[null,""]
[null,""]
[null,""]
[null,""]
[null,""]
[null,""]
[null,""]
[null,{"$f":"IF(C461=\"\",\"\",B460+1)","v":""}]
[null,""]
[null,""]
[null,""]
[null,""]
[null,""]
[null,""]
[null,""]
[null,""]
[null,""]
[null,""]
[null,""]
[null,""]
[null,""]
[null,""]
[null,""]
[null,""]
[null,""]
[null,""]
[null,""]
[null,""]
[null,""]
[null,""]
[null,""]
[null,""]
[null,""]
[null,""]
[null,""]
[null,""]
[null,""]
[null,""]
[null,""]
[null,""]
[null,""]
[null,""]
[null,""]
[null,""]
[null,""]
[null,""]
[null,""]
[null,""]
[null,""]
[null,""]
[null,""]
[null,""]
[null,""]
[null,""]
[null,""]
[null,""]
[null,""]
[]
[null,null,null,null,null,null,null,null,null,null,null,null,null,null,null,null,null,null,null,null,null,null,null,null,null,null,null,null,null,null,null,null,null,null,"Totais pagas",{"$f":"SUM(AJ11:AJ510)","v":0},{"$f":"SUM(AK11:AK510)","v":0},0,0,0,{"$f":"SUM(AO11:AO510)","v":0}]

{"sheet":"Guia 8","index":7,"n_rows":512,"n_cols":46,"rows_kept":512,"cut":false,"hidden":true,"merged":[[4,2,4,8],[5,4,5,7],[6,2,6,5],[6,6,6,9],[6,10,6,11],[7,19,8,19],[6,15,6,22],[6,23,6,34],[6,35,6,45],[7,2,8,2],[7,3,8,3],[7,4,8,4],[7,5,8,5],[7,6,8,6],[7,7,8,7],[7,8,8,8],[6,14,8,14],[7,9,8,9],[7,10,8,10],[7,11,8,11],[7,12,8,12],[7,13,8,13],[7,15,8,15],[7,16,8,16],[7,17,8,17],[7,18,8,18],[7,35,7,40],[7,41,7,43],[7,44,7,45],[7,20,8,20],[7,21,8,21],[7,22,8,22],[7,23,7,28],[7,29,7,31],[7,32,7,34]]}
[]
[null,null,"Superior Tribunal de Justiça"]
[null,null,"Secretaria de Processamento de Feitos"]
[null,null,"Coordenadoria de Processamento de Feitos em Execução Judicial"]
[null,null,{"$f":"\"Relação das Requisições de Pequeno Valor - RPV pagas pelo STJ em \"&IF(F11=\"\",\"\",UPPER((TEXT(F11,\"mmmm/aaaa\"))))","v":"Relação das Requisições de Pequeno Valor - RPV pagas pelo STJ em "}]
[]
[null,null,"RPV",null,null,null,"P R O C E S S O     D E     O R I G E M",null,null,null,"E N T I D A D E S",null,"R E Q U E R E N T E","A D V O G A D O","Natureza do crédito","I N D I C A D O R E S",null,null,null,null,null,null,null,"VALORES REQUISITADOS",null,null,null,null,null,null,null,null,null,null,null,"VALORES ATUALIZADOS PARA PAGAMENTO"]
[null,null,"Nº","Registro","Autuada em","data do pgto","Ação","Autuada em","Tipo de causa","Trânsito","Entidade devedora","Órgão de origem","Origem do crédito","Origem do crédito",null,"Tributário","EC 94 2016","Lei 13.463 2017","PRC/RPV de origem","Nº DA GRU","DOENÇA GRAVE","Deficiência física","Isento de IR","Beneficiários",null,null,null,null,null,"PSSS",null,null,"R R A",null,null,"Beneficiários",null,null,null,null,null,"P S S S",null,null,"R R A"]
[null,null,null,null,null,null,null,null,null,null,null,null,null,null,null,null,null,null,null,null,null,null,null,"Total","Adv I","Adv II","Adv III","Adv IV","Requerente","Base","Desc","Patronal","NMA","Exercícios anteriores","Desconto","Total","Adv I","Adv II","Adv III","Adv IV","Reqte","BASE desc","Desc","Patronal","Exercícios anteriores","Dedução"]
[]
[null,{"$f":"IF(C11=\"\",\"\",1)","v":""}]
[null,{"$f":"IF(C12=\"\",\"\",B11+1)","v":""}]
[null,{"$f":"IF(C13=\"\",\"\",B12+1)","v":""}]
[null,""]
[null,""]
[null,""]
[null,""]
[null,""]
[null,""]
[null,""]
[null,""]
[null,""]
[null,""]
[null,""]
[null,""]
[null,""]
[null,""]
[null,""]
[null,""]
[null,""]
[null,""]
[null,""]
[null,""]
[null,""]
[null,""]
[null,""]
[null,""]
[null,""]
[null,""]
[null,""]
[null,""]
[null,""]
[null,""]
[null,""]
[null,""]
[null,""]
[null,""]
[null,""]
[null,""]
[null,""]
[null,""]
[null,""]
[null,""]
[null,""]
[null,""]
[null,""]
[null,""]
[null,""]
[null,""]
[null,""]
[null,""]
[null,""]
[null,""]
[null,""]
[null,""]
[null,""]
[null,""]
[null,""]
[null,""]
[null,""]
[null,""]
[null,""]
[null,""]
[null,""]
[null,""]
[null,""]
[null,{"$f":"IF(C77=\"\",\"\",B76+1)","v":""}]
[null,""]
[null,""]
[null,""]
[null,""]
[null,""]
[null,""]
[null,""]
[null,""]
[null,""]
[null,""]
[null,""]
[null,""]
[null,""]
[null,""]
[null,""]
[null,""]
[null,""]
[null,""]
[null,""]
[null,""]
[null,""]
[null,""]
[null,""]
[null,""]
[null,""]
[null,""]
[null,""]
[null,""]
[null,""]
[null,""]
[null,""]
[null,""]
[null,""]
[null,""]
[null,""]
[null,""]
[null,""]
[null,""]
[null,""]
[null,""]
[null,""]
[null,""]
[null,""]
[null,""]
[null,""]
[null,""]
[null,""]
[null,""]
[null,""]
[null,""]
[null,""]
[null,""]
[null,""]
[null,""]
[null,""]
[null,""]
[null,""]
[null,""]
[null,""]
[null,""]
[null,""]
[null,""]
[null,""]
[null,{"$f":"IF(C141=\"\",\"\",B140+1)","v":""}]
[null,""]
[null,""]
[null,""]
[null,""]
[null,""]
[null,""]
[null,""]
[null,""]
[null,""]
[null,""]
[null,""]
[null,""]
[null,""]
[null,""]
[null,""]
[null,""]
[null,""]
[null,""]
[null,""]
[null,""]
[null,""]
[null,""]
[null,""]
[null,""]
[null,""]
[null,""]
[null,""]
[null,""]
[null,""]
[null,""]
[null,""]
[null,""]
[null,""]
[null,""]
[null,""]
[null,""]
[null,""]
[null,""]
[null,""]
[null,""]
[null,""]
[null,""]
[null,""]
[null,""]
[null,""]
[null,""]
[null,""]
[null,""]
[null,""]
[null,""]
[null,""]
[null,""]
[null,""]
[null,""]
[null,""]
[null,""]
[null,""]
[null,""]
[null,""]
[null,""]
[null,""]
[null,""]
[null,""]
[null,{"$f":"IF(C205=\"\",\"\",B204+1)","v":""}]
[null,""]
[null,""]
[null,""]
[null,""]
[null,""]
[null,""]
[null,""]
[null,""]
[null,""]
[null,""]
[null,""]
[null,""]
[null,""]
[null,""]
[null,""]
[null,""]
[null,""]
[null,""]
[null,""]
[null,""]
[null,""]
[null,""]
[null,""]
[null,""]
[null,""]
[null,""]
[null,""]
[null,""]
[null,""]
[null,""]
[null,""]
[null,""]
[null,""]
[null,""]
[null,""]
[null,""]
[null,""]
[null,""]
[null,""]
[null,""]
[null,""]
[null,""]
[null,""]
[null,""]
[null,""]
[null,""]
[null,""]
[null,""]
[null,""]
[null,""]
[null,""]
[null,""]
[null,""]
[null,""]
[null,""]
[null,""]
[null,""]
[null,""]
[null,""]
[null,""]
[null,""]
[null,""]
[null,""]
[null,{"$f":"IF(C269=\"\",\"\",B268+1)","v":""}]
[null,""]
[null,""]
[null,""]
[null,""]
[null,""]
[null,""]
[null,""]
[null,""]
[null,""]
[null,""]
[null,""]
[null,""]
[null,""]
[null,""]
[null,""]
[null,""]
[null,""]
[null,""]
[null,""]
[null,""]
[null,""]
[null,""]
[null,""]
[null,""]
[null,""]
[null,""]
[null,""]
[null,""]
[null,""]
[null,""]
[null,""]
[null,""]
[null,""]
[null,""]
[null,""]
[null,""]
[null,""]
[null,""]
[null,""]
[null,""]
[null,""]
[null,""]
[null,""]
[null,""]
[null,""]
[null,""]
[null,""]
[null,""]
[null,""]
[null,""]
[null,""]
[null,""]
[null,""]
[null,""]
[null,""]
[null,""]
[null,""]
[null,""]
[null,""]
[null,""]
[null,""]
[null,""]
[null,""]
[null,{"$f":"IF(C333=\"\",\"\",B332+1)","v":""}]
[null,""]
[null,""]
[null,""]
[null,""]
[null,""]
[null,""]
[null,""]
[null,""]
[null,""]
[null,""]
[null,""]
[null,""]
[null,""]
[null,""]
[null,""]
[null,""]
[null,""]
[null,""]
[null,""]
[null,""]
[null,""]
[null,""]
[null,""]
[null,""]
[null,""]
[null,""]
[null,""]
[null,""]
[null,""]
[null,""]
[null,""]
[null,""]
[null,""]
[null,""]
[null,""]
[null,""]
[null,""]
[null,""]
[null,""]
[null,""]
[null,""]
[null,""]
[null,""]
[null,""]
[null,""]
[null,""]
[null,""]
[null,""]
[null,""]
[null,""]
[null,""]
[null,""]
[null,""]
[null,""]
[null,""]
[null,""]
[null,""]
[null,""]
[null,""]
[null,""]
[null,""]
[null,""]
[null,""]
[null,{"$f":"IF(C397=\"\",\"\",B396+1)","v":""}]
[null,""]
[null,""]
[null,""]
[null,""]
[null,""]
[null,""]
[null,""]
[null,""]
[null,""]
[null,""]
[null,""]
[null,""]
[null,""]
[null,""]
[null,""]
[null,""]
[null,""]
[null,""]
[null,""]
[null,""]
[null,""]
[null,""]
[null,""]
[null,""]
[null,""]
[null,""]
[null,""]
[null,""]
[null,""]
[null,""]
[null,""]
[null,""]
[null,""]
[null,""]
[null,""]
[null,""]
[null,""]
[null,""]
[null,""]
[null,""]
[null,""]
[null,""]
[null,""]
[null,""]
[null,""]
[null,""]
[null,""]
[null,""]
[null,""]
[null,""]
[null,""]
[null,""]
[null,""]
[null,""]
[null,""]
[null,""]
[null,""]
[null,""]
[null,""]
[null,""]
[null,""]
[null,""]
[null,""]
[null,{"$f":"IF(C461=\"\",\"\",B460+1)","v":""}]
[null,""]
[null,""]
[null,""]
[null,""]
[null,""]
[null,""]
[null,""]
[null,""]
[null,""]
[null,""]
[null,""]
[null,""]
[null,""]
[null,""]
[null,""]
[null,""]
[null,""]
[null,""]
[null,""]
[null,""]
[null,""]
[null,""]
[null,""]
[null,""]
[null,""]
[null,""]
[null,""]
[null,""]
[null,""]
[null,""]
[null,""]
[null,""]
[null,""]
[null,""]
[null,""]
[null,""]
[null,""]
[null,""]
[null,""]
[null,""]
[null,""]
[null,""]
[null,""]
[null,""]
[null,""]
[null,""]
[null,""]
[null,""]
[null,""]
[]
[null,null,null,null,null,null,null,null,null,null,null,null,null,null,null,null,null,null,null,null,null,null,null,null,null,null,null,null,null,null,null,null,null,null,"Totais pagas",{"$f":"SUM(AJ11:AJ510)","v":0},{"$f":"SUM(AK11:AK510)","v":0},0,0,0,{"$f":"SUM(AO11:AO510)","v":0}]

{"sheet":"Guia 9","index":8,"n_rows":512,"n_cols":46,"rows_kept":512,"cut":false,"hidden":true,"merged":[[4,2,4,8],[5,4,5,7],[6,2,6,5],[6,6,6,9],[6,10,6,11],[7,19,8,19],[6,15,6,22],[6,23,6,34],[6,35,6,45],[7,2,8,2],[7,3,8,3],[7,4,8,4],[7,5,8,5],[7,6,8,6],[7,7,8,7],[7,8,8,8],[6,14,8,14],[7,9,8,9],[7,10,8,10],[7,11,8,11],[7,12,8,12],[7,13,8,13],[7,15,8,15],[7,16,8,16],[7,17,8,17],[7,18,8,18],[7,35,7,40],[7,41,7,43],[7,44,7,45],[7,20,8,20],[7,21,8,21],[7,22,8,22],[7,23,7,28],[7,29,7,31],[7,32,7,34]]}
[]
[null,null,"Superior Tribunal de Justiça"]
[null,null,"Secretaria de Processamento de Feitos"]
[null,null,"Coordenadoria de Processamento de Feitos em Execução Judicial"]
[null,null,{"$f":"\"Relação das Requisições de Pequeno Valor - RPV pagas pelo STJ em \"&IF(F11=\"\",\"\",UPPER((TEXT(F11,\"mmmm/aaaa\"))))","v":"Relação das Requisições de Pequeno Valor - RPV pagas pelo STJ em "}]
[]
[null,null,"RPV",null,null,null,"P R O C E S S O     D E     O R I G E M",null,null,null,"E N T I D A D E S",null,"R E Q U E R E N T E","A D V O G A D O","Natureza do crédito","I N D I C A D O R E S",null,null,null,null,null,null,null,"VALORES REQUISITADOS",null,null,null,null,null,null,null,null,null,null,null,"VALORES ATUALIZADOS PARA PAGAMENTO"]
[null,null,"Nº","Registro","Autuada em","data do pgto","Ação","Autuada em","Tipo de causa","Trânsito","Entidade devedora","Órgão de origem","Origem do crédito","Origem do crédito",null,"Tributário","EC 94 2016","Lei 13.463 2017","PRC/RPV de origem","Nº DA GRU","DOENÇA GRAVE","Deficiência física","Isento de IR","Beneficiários",null,null,null,null,null,"PSSS",null,null,"R R A",null,null,"Beneficiários",null,null,null,null,null,"P S S S",null,null,"R R A"]
[null,null,null,null,null,null,null,null,null,null,null,null,null,null,null,null,null,null,null,null,null,null,null,"Total","Adv I","Adv II","Adv III","Adv IV","Requerente","Base","Desc","Patronal","NMA","Exercícios anteriores","Desconto","Total","Adv I","Adv II","Adv III","Adv IV","Reqte","BASE desc","Desc","Patronal","Exercícios anteriores","Dedução"]
[]
[null,{"$f":"IF(C11=\"\",\"\",1)","v":""}]
[null,{"$f":"IF(C12=\"\",\"\",B11+1)","v":""}]
[null,{"$f":"IF(C13=\"\",\"\",B12+1)","v":""}]
[null,""]
[null,""]
[null,""]
[null,""]
[null,""]
[null,""]
[null,""]
[null,""]
[null,""]
[null,""]
[null,""]
[null,""]
[null,""]
[null,""]
[null,""]
[null,""]
[null,""]
[null,""]
[null,""]
[null,""]
[null,""]
[null,""]
[null,""]
[null,""]
[null,""]
[null,""]
[null,""]
[null,""]
[null,""]
[null,""]
[null,""]
[null,""]
[null,""]
[null,""]
[null,""]
[null,""]
[null,""]
[null,""]
[null,""]
[null,""]
[null,""]
[null,""]
[null,""]
[null,""]
[null,""]
[null,""]
[null,""]
[null,""]
[null,""]
[null,""]
[null,""]
[null,""]
[null,""]
[null,""]
[null,""]
[null,""]
[null,""]
[null,""]
[null,""]
[null,""]
[null,""]
[null,""]
[null,""]
[null,{"$f":"IF(C77=\"\",\"\",B76+1)","v":""}]
[null,""]
[null,""]
[null,""]
[null,""]
[null,""]
[null,""]
[null,""]
[null,""]
[null,""]
[null,""]
[null,""]
[null,""]
[null,""]
[null,""]
[null,""]
[null,""]
[null,""]
[null,""]
[null,""]
[null,""]
[null,""]
[null,""]
[null,""]
[null,""]
[null,""]
[null,""]
[null,""]
[null,""]
[null,""]
[null,""]
[null,""]
[null,""]
[null,""]
[null,""]
[null,""]
[null,""]
[null,""]
[null,""]
[null,""]
[null,""]
[null,""]
[null,""]
[null,""]
[null,""]
[null,""]
[null,""]
[null,""]
[null,""]
[null,""]
[null,""]
[null,""]
[null,""]
[null,""]
[null,""]
[null,""]
[null,""]
[null,""]
[null,""]
[null,""]
[null,""]
[null,""]
[null,""]
[null,""]
[null,{"$f":"IF(C141=\"\",\"\",B140+1)","v":""}]
[null,""]
[null,""]
[null,""]
[null,""]
[null,""]
[null,""]
[null,""]
[null,""]
[null,""]
[null,""]
[null,""]
[null,""]
[null,""]
[null,""]
[null,""]
[null,""]
[null,""]
[null,""]
[null,""]
[null,""]
[null,""]
[null,""]
[null,""]
[null,""]
[null,""]
[null,""]
[null,""]
[null,""]
[null,""]
[null,""]
[null,""]
[null,""]
[null,""]
[null,""]
[null,""]
[null,""]
[null,""]
[null,""]
[null,""]
[null,""]
[null,""]
[null,""]
[null,""]
[null,""]
[null,""]
[null,""]
[null,""]
[null,""]
[null,""]
[null,""]
[null,""]
[null,""]
[null,""]
[null,""]
[null,""]
[null,""]
[null,""]
[null,""]
[null,""]
[null,""]
[null,""]
[null,""]
[null,""]
[null,{"$f":"IF(C205=\"\",\"\",B204+1)","v":""}]
[null,""]
[null,""]
[null,""]
[null,""]
[null,""]
[null,""]
[null,""]
[null,""]
[null,""]
[null,""]
[null,""]
[null,""]
[null,""]
[null,""]
[null,""]
[null,""]
[null,""]
[null,""]
[null,""]
[null,""]
[null,""]
[null,""]
[null,""]
[null,""]
[null,""]
[null,""]
[null,""]
[null,""]
[null,""]
[null,""]
[null,""]
[null,""]
[null,""]
[null,""]
[null,""]
[null,""]
[null,""]
[null,""]
[null,""]
[null,""]
[null,""]
[null,""]
[null,""]
[null,""]
[null,""]
[null,""]
[null,""]
[null,""]
[null,""]
[null,""]
[null,""]
[null,""]
[null,""]
[null,""]
[null,""]
[null,""]
[null,""]
[null,""]
[null,""]
[null,""]
[null,""]
[null,""]
[null,""]
[null,{"$f":"IF(C269=\"\",\"\",B268+1)","v":""}]
[null,""]
[null,""]
[null,""]
[null,""]
[null,""]
[null,""]
[null,""]
[null,""]
[null,""]
[null,""]
[null,""]
[null,""]
[null,""]
[null,""]
[null,""]
[null,""]
[null,""]
[null,""]
[null,""]
[null,""]
[null,""]
[null,""]
[null,""]
[null,""]
[null,""]
[null,""]
[null,""]
[null,""]
[null,""]
[null,""]
[null,""]
[null,""]
[null,""]
[null,""]
[null,""]
[null,""]
[null,""]
[null,""]
[null,""]
[null,""]
[null,""]
[null,""]
[null,""]
[null,""]
[null,""]
[null,""]
[null,""]
[null,""]
[null,""]
[null,""]
[null,""]
[null,""]
[null,""]
[null,""]
[null,""]
[null,""]
[null,""]
[null,""]
[null,""]
[null,""]
[null,""]
[null,""]
[null,""]
[null,{"$f":"IF(C333=\"\",\"\",B332+1)","v":""}]
[null,""]
[null,""]
[null,""]
[null,""]
[null,""]
[null,""]
[null,""]
[null,""]
[null,""]
[null,""]
[null,""]
[null,""]
[null,""]
[null,""]
[null,""]
[null,""]
[null,""]
[null,""]
[null,""]
[null,""]
[null,""]
[null,""]
[null,""]
[null,""]
[null,""]
[null,""]
[null,""]
[null,""]
[null,""]
[null,""]
[null,""]
[null,""]
[null,""]
[null,""]
[null,""]
[null,""]
[null,""]
[null,""]
[null,""]
[null,""]
[null,""]
[null,""]
[null,""]
[null,""]
[null,""]
[null,""]
[null,""]
[null,""]
[null,""]
[null,""]
[null,""]
[null,""]
[null,""]
[null,""]
[null,""]
[null,""]
[null,""]
[null,""]
[null,""]
[null,""]
[null,""]
[null,""]
[null,""]
[null,{"$f":"IF(C397=\"\",\"\",B396+1)","v":""}]
[null,""]
[null,""]
[null,""]
[null,""]
[null,""]
[null,""]
[null,""]
[null,""]
[null,""]
[null,""]
[null,""]
[null,""]
[null,""]
[null,""]
[null,""]
[null,""]
[null,""]
[null,""]
[null,""]
[null,""]
[null,""]
[null,""]
[null,""]
[null,""]
[null,""]
[null,""]
[null,""]
[null,""]
[null,""]
[null,""]
[null,""]
[null,""]
[null,""]
[null,""]
[null,""]
[null,""]
[null,""]
[null,""]
[null,""]
[null,""]
[null,""]
[null,""]
[null,""]
[null,""]
[null,""]
[null,""]
[null,""]
[null,""]
[null,""]
[null,""]
[null,""]
[null,""]
[null,""]
[null,""]
[null,""]
[null,""]
[null,""]
[null,""]
[null,""]
[null,""]
[null,""]
[null,""]
[null,""]
[null,{"$f":"IF(C461=\"\",\"\",B460+1)","v":""}]
[null,""]
[null,""]
[null,""]
[null,""]
[null,""]
[null,""]
[null,""]
[null,""]
[null,""]
[null,""]
[null,""]
[null,""]
[null,""]
[null,""]
[null,""]
[null,""]
[null,""]
[null,""]
[null,""]
[null,""]
[null,""]
[null,""]
[null,""]
[null,""]
[null,""]
[null,""]
[null,""]
[null,""]
[null,""]
[null,""]
[null,""]
[null,""]
[null,""]
[null,""]
[null,""]
[null,""]
[null,""]
[null,""]
[null,""]
[null,""]
[null,""]
[null,""]
[null,""]
[null,""]
[null,""]
[null,""]
[null,""]
[null,""]
[null,""]
[]
[null,null,null,null,null,null,null,null,null,null,null,null,null,null,null,null,null,null,null,null,null,null,null,null,null,null,null,null,null,null,null,null,null,null,"Totais pagas",{"$f":"SUM(AJ11:AJ510)","v":0},{"$f":"SUM(AK11:AK510)","v":0},0,0,0,{"$f":"SUM(AO11:AO510)","v":0}]

{"sheet":"Guia 10","index":9,"n_rows":512,"n_cols":46,"rows_kept":512,"cut":false,"hidden":true,"merged":[[4,2,4,8],[5,4,5,7],[6,2,6,5],[6,6,6,9],[6,10,6,11],[7,19,8,19],[6,15,6,22],[6,23,6,34],[6,35,6,45],[7,2,8,2],[7,3,8,3],[7,4,8,4],[7,5,8,5],[7,6,8,6],[7,7,8,7],[7,8,8,8],[6,14,8,14],[7,9,8,9],[7,10,8,10],[7,11,8,11],[7,12,8,12],[7,13,8,13],[7,15,8,15],[7,16,8,16],[7,17,8,17],[7,18,8,18],[7,35,7,40],[7,41,7,43],[7,44,7,45],[7,20,8,20],[7,21,8,21],[7,22,8,22],[7,23,7,28],[7,29,7,31],[7,32,7,34]]}
[]
[null,null,"Superior Tribunal de Justiça"]
[null,null,"Secretaria de Processamento de Feitos"]
[null,null,"Coordenadoria de Processamento de Feitos em Execução Judicial"]
[null,null,{"$f":"\"Relação das Requisições de Pequeno Valor - RPV pagas pelo STJ em \"&IF(F11=\"\",\"\",UPPER((TEXT(F11,\"mmmm/aaaa\"))))","v":"Relação das Requisições de Pequeno Valor - RPV pagas pelo STJ em "}]
[]
[null,null,"RPV",null,null,null,"P R O C E S S O     D E     O R I G E M",null,null,null,"E N T I D A D E S",null,"R E Q U E R E N T E","A D V O G A D O","Natureza do crédito","I N D I C A D O R E S",null,null,null,null,null,null,null,"VALORES REQUISITADOS",null,null,null,null,null,null,null,null,null,null,null,"VALORES ATUALIZADOS PARA PAGAMENTO"]
[null,null,"Nº","Registro","Autuada em","data do pgto","Ação","Autuada em","Tipo de causa","Trânsito","Entidade devedora","Órgão de origem","Origem do crédito","Origem do crédito",null,"Tributário","EC 94 2016","Lei 13.463 2017","PRC/RPV de origem","Nº DA GRU","DOENÇA GRAVE","Deficiência física","Isento de IR","Beneficiários",null,null,null,null,null,"PSSS",null,null,"R R A",null,null,"Beneficiários",null,null,null,null,null,"P S S S",null,null,"R R A"]
[null,null,null,null,null,null,null,null,null,null,null,null,null,null,null,null,null,null,null,null,null,null,null,"Total","Adv I","Adv II","Adv III","Adv IV","Requerente","Base","Desc","Patronal","NMA","Exercícios anteriores","Desconto","Total","Adv I","Adv II","Adv III","Adv IV","Reqte","BASE desc","Desc","Patronal","Exercícios anteriores","Dedução"]
[]
[null,{"$f":"IF(C11=\"\",\"\",1)","v":""}]
[null,{"$f":"IF(C12=\"\",\"\",B11+1)","v":""}]
[null,{"$f":"IF(C13=\"\",\"\",B12+1)","v":""}]
[null,""]
[null,""]
[null,""]
[null,""]
[null,""]
[null,""]
[null,""]
[null,""]
[null,""]
[null,""]
[null,""]
[null,""]
[null,""]
[null,""]
[null,""]
[null,""]
[null,""]
[null,""]
[null,""]
[null,""]
[null,""]
[null,""]
[null,""]
[null,""]
[null,""]
[null,""]
[null,""]
[null,""]
[null,""]
[null,""]
[null,""]
[null,""]
[null,""]
[null,""]
[null,""]
[null,""]
[null,""]
[null,""]
[null,""]
[null,""]
[null,""]
[null,""]
[null,""]
[null,""]
[null,""]
[null,""]
[null,""]
[null,""]
[null,""]
[null,""]
[null,""]
[null,""]
[null,""]
[null,""]
[null,""]
[null,""]
[null,""]
[null,""]
[null,""]
[null,""]
[null,""]
[null,""]
[null,""]
[null,{"$f":"IF(C77=\"\",\"\",B76+1)","v":""}]
[null,""]
[null,""]
[null,""]
[null,""]
[null,""]
[null,""]
[null,""]
[null,""]
[null,""]
[null,""]
[null,""]
[null,""]
[null,""]
[null,""]
[null,""]
[null,""]
[null,""]
[null,""]
[null,""]
[null,""]
[null,""]
[null,""]
[null,""]
[null,""]
[null,""]
[null,""]
[null,""]
[null,""]
[null,""]
[null,""]
[null,""]
[null,""]
[null,""]
[null,""]
[null,""]
[null,""]
[null,""]
[null,""]
[null,""]
[null,""]
[null,""]
[null,""]
[null,""]
[null,""]
[null,""]
[null,""]
[null,""]
[null,""]
[null,""]
[null,""]
[null,""]
[null,""]
[null,""]
[null,""]
[null,""]
[null,""]
[null,""]
[null,""]
[null,""]
[null,""]
[null,""]
[null,""]
[null,""]
[null,{"$f":"IF(C141=\"\",\"\",B140+1)","v":""}]
[null,""]
[null,""]
[null,""]
[null,""]
[null,""]
[null,""]
[null,""]
[null,""]
[null,""]
[null,""]
[null,""]
[null,""]
[null,""]
[null,""]
[null,""]
[null,""]
[null,""]
[null,""]
[null,""]
[null,""]
[null,""]
[null,""]
[null,""]
[null,""]
[null,""]
[null,""]
[null,""]
[null,""]
[null,""]
[null,""]
[null,""]
[null,""]
[null,""]
[null,""]
[null,""]
[null,""]
[null,""]
[null,""]
[null,""]
[null,""]
[null,""]
[null,""]
[null,""]
[null,""]
[null,""]
[null,""]
[null,""]
[null,""]
[null,""]
[null,""]
[null,""]
[null,""]
[null,""]
[null,""]
[null,""]
[null,""]
[null,""]
[null,""]
[null,""]
[null,""]
[null,""]
[null,""]
[null,""]
[null,{"$f":"IF(C205=\"\",\"\",B204+1)","v":""}]
[null,""]
[null,""]
[null,""]
[null,""]
[null,""]
[null,""]
[null,""]
[null,""]
[null,""]
[null,""]
[null,""]
[null,""]
[null,""]
[null,""]
[null,""]
[null,""]
[null,""]
[null,""]
[null,""]
[null,""]
[null,""]
[null,""]
[null,""]
[null,""]
[null,""]
[null,""]
[null,""]
[null,""]
[null,""]
[null,""]
[null,""]
[null,""]
[null,""]
[null,""]
[null,""]
[null,""]
[null,""]
[null,""]
[null,""]
[null,""]
[null,""]
[null,""]
[null,""]
[null,""]
[null,""]
[null,""]
[null,""]
[null,""]
[null,""]
[null,""]
[null,""]
[null,""]
[null,""]
[null,""]
[null,""]
[null,""]
[null,""]
[null,""]
[null,""]
[null,""]
[null,""]
[null,""]
[null,""]
[null,{"$f":"IF(C269=\"\",\"\",B268+1)","v":""}]
[null,""]
[null,""]
[null,""]
[null,""]
[null,""]
[null,""]
[null,""]
[null,""]
[null,""]
[null,""]
[null,""]
[null,""]
[null,""]
[null,""]
[null,""]
[null,""]
[null,""]
[null,""]
[null,""]
[null,""]
[null,""]
[null,""]
[null,""]
[null,""]
[null,""]
[null,""]
[null,""]
[null,""]
[null,""]
[null,""]
[null,""]
[null,""]
[null,""]
[null,""]
[null,""]
[null,""]
[null,""]
[null,""]
[null,""]
[null,""]
[null,""]
[null,""]
[null,""]
[null,""]
[null,""]
[null,""]
[null,""]
[null,""]
[null,""]
[null,""]
[null,""]
[null,""]
[null,""]
[null,""]
[null,""]
[null,""]
[null,""]
[null,""]
[null,""]
[null,""]
[null,""]
[null,""]
[null,""]
[null,{"$f":"IF(C333=\"\",\"\",B332+1)","v":""}]
[null,""]
[null,""]
[null,""]
[null,""]
[null,""]
[null,""]
[null,""]
[null,""]
[null,""]
[null,""]
[null,""]
[null,""]
[null,""]
[null,""]
[null,""]
[null,""]
[null,""]
[null,""]
[null,""]
[null,""]
[null,""]
[null,""]
[null,""]
[null,""]
[null,""]
[null,""]
[null,""]
[null,""]
[null,""]
[null,""]
[null,""]
[null,""]
[null,""]
[null,""]
[null,""]
[null,""]
[null,""]
[null,""]
[null,""]
[null,""]
[null,""]
[null,""]
[null,""]
[null,""]
[null,""]
[null,""]
[null,""]
[null,""]
[null,""]
[null,""]
[null,""]
[null,""]
[null,""]
[null,""]
[null,""]
[null,""]
[null,""]
[null,""]
[null,""]
[null,""]
[null,""]
[null,""]
[null,""]
[null,{"$f":"IF(C397=\"\",\"\",B396+1)","v":""}]
[null,""]
[null,""]
[null,""]
[null,""]
[null,""]
[null,""]
[null,""]
[null,""]
[null,""]
[null,""]
[null,""]
[null,""]
[null,""]
[null,""]
[null,""]
[null,""]
[null,""]
[null,""]
[null,""]
[null,""]
[null,""]
[null,""]
[null,""]
[null,""]
[null,""]
[null,""]
[null,""]
[null,""]
[null,""]
[null,""]
[null,""]
[null,""]
[null,""]
[null,""]
[null,""]
[null,""]
[null,""]
[null,""]
[null,""]
[null,""]
[null,""]
[null,""]
[null,""]
[null,""]
[null,""]
[null,""]
[null,""]
[null,""]
[null,""]
[null,""]
[null,""]
[null,""]
[null,""]
[null,""]
[null,""]
[null,""]
[null,""]
[null,""]
[null,""]
[null,""]
[null,""]
[null,""]
[null,""]
[null,{"$f":"IF(C461=\"\",\"\",B460+1)","v":""}]
[null,""]
[null,""]
[null,""]
[null,""]
[null,""]
[null,""]
[null,""]
[null,""]
[null,""]
[null,""]
[null,""]
[null,""]
[null,""]
[null,""]
[null,""]
[null,""]
[null,""]
[null,""]
[null,""]
[null,""]
[null,""]
[null,""]
[null,""]
[null,""]
[null,""]
[null,""]
[null,""]
[null,""]
[null,""]
[null,""]
[null,""]
[null,""]
[null,""]
[null,""]
[null,""]
[null,""]
[null,""]
[null,""]
[null,""]
[null,""]
[null,""]
[null,""]
[null,""]
[null,""]
[null,""]
[null,""]
[null,""]
[null,""]
[null,""]
[]
[null,null,null,null,null,null,null,null,null,null,null,null,null,null,null,null,null,null,null,null,null,null,null,null,null,null,null,null,null,null,null,null,null,null,"Totais pagas",{"$f":"SUM(AJ11:AJ510)","v":0},{"$f":"SUM(AK11:AK510)","v":0},0,0,0,{"$f":"SUM(AO11:AO510)","v":0}]

{"sheet":"Guia 11","index":10,"n_rows":512,"n_cols":46,"rows_kept":512,"cut":false,"hidden":true,"merged":[[4,2,4,8],[5,4,5,7],[6,2,6,5],[6,6,6,9],[6,10,6,11],[7,19,8,19],[6,15,6,22],[6,23,6,34],[6,35,6,45],[7,2,8,2],[7,3,8,3],[7,4,8,4],[7,5,8,5],[7,6,8,6],[7,7,8,7],[7,8,8,8],[6,14,8,14],[7,9,8,9],[7,10,8,10],[7,11,8,11],[7,12,8,12],[7,13,8,13],[7,15,8,15],[7,16,8,16],[7,17,8,17],[7,18,8,18],[7,35,7,40],[7,41,7,43],[7,44,7,45],[7,20,8,20],[7,21,8,21],[7,22,8,22],[7,23,7,28],[7,29,7,31],[7,32,7,34]]}
[]
[null,null,"Superior Tribunal de Justiça"]
[null,null,"Secretaria de Processamento de Feitos"]
[null,null,"Coordenadoria de Processamento de Feitos em Execução Judicial"]
[null,null,{"$f":"\"Relação das Requisições de Pequeno Valor - RPV pagas pelo STJ em \"&IF(F11=\"\",\"\",UPPER((TEXT(F11,\"mmmm/aaaa\"))))","v":"Relação das Requisições de Pequeno Valor - RPV pagas pelo STJ em "}]
[]
[null,null,"RPV",null,null,null,"P R O C E S S O     D E     O R I G E M",null,null,null,"E N T I D A D E S",null,"R E Q U E R E N T E","A D V O G A D O","Natureza do crédito","I N D I C A D O R E S",null,null,null,null,null,null,null,"VALORES REQUISITADOS",null,null,null,null,null,null,null,null,null,null,null,"VALORES ATUALIZADOS PARA PAGAMENTO"]
[null,null,"Nº","Registro","Autuada em","data do pgto","Ação","Autuada em","Tipo de causa","Trânsito","Entidade devedora","Órgão de origem","Origem do crédito","Origem do crédito",null,"Tributário","EC 94 2016","Lei 13.463 2017","PRC/RPV de origem","Nº DA GRU","DOENÇA GRAVE","Deficiência física","Isento de IR","Beneficiários",null,null,null,null,null,"PSSS",null,null,"R R A",null,null,"Beneficiários",null,null,null,null,null,"P S S S",null,null,"R R A"]
[null,null,null,null,null,null,null,null,null,null,null,null,null,null,null,null,null,null,null,null,null,null,null,"Total","Adv I","Adv II","Adv III","Adv IV","Requerente","Base","Desc","Patronal","NMA","Exercícios anteriores","Desconto","Total","Adv I","Adv II","Adv III","Adv IV","Reqte","BASE desc","Desc","Patronal","Exercícios anteriores","Dedução"]
[]
[null,{"$f":"IF(C11=\"\",\"\",1)","v":""}]
[null,{"$f":"IF(C12=\"\",\"\",B11+1)","v":""}]
[null,{"$f":"IF(C13=\"\",\"\",B12+1)","v":""}]
[null,""]
[null,""]
[null,""]
[null,""]
[null,""]
[null,""]
[null,""]
[null,""]
[null,""]
[null,""]
[null,""]
[null,""]
[null,""]
[null,""]
[null,""]
[null,""]
[null,""]
[null,""]
[null,""]
[null,""]
[null,""]
[null,""]
[null,""]
[null,""]
[null,""]
[null,""]
[null,""]
[null,""]
[null,""]
[null,""]
[null,""]
[null,""]
[null,""]
[null,""]
[null,""]
[null,""]
[null,""]
[null,""]
[null,""]
[null,""]
[null,""]
[null,""]
[null,""]
[null,""]
[null,""]
[null,""]
[null,""]
[null,""]
[null,""]
[null,""]
[null,""]
[null,""]
[null,""]
[null,""]
[null,""]
[null,""]
[null,""]
[null,""]
[null,""]
[null,""]
[null,""]
[null,""]
[null,""]
[null,{"$f":"IF(C77=\"\",\"\",B76+1)","v":""}]
[null,""]
[null,""]
[null,""]
[null,""]
[null,""]
[null,""]
[null,""]
[null,""]
[null,""]
[null,""]
[null,""]
[null,""]
[null,""]
[null,""]
[null,""]
[null,""]
[null,""]
[null,""]
[null,""]
[null,""]
[null,""]
[null,""]
[null,""]
[null,""]
[null,""]
[null,""]
[null,""]
[null,""]
[null,""]
[null,""]
[null,""]
[null,""]
[null,""]
[null,""]
[null,""]
[null,""]
[null,""]
[null,""]
[null,""]
[null,""]
[null,""]
[null,""]
[null,""]
[null,""]
[null,""]
[null,""]
[null,""]
[null,""]
[null,""]
[null,""]
[null,""]
[null,""]
[null,""]
[null,""]
[null,""]
[null,""]
[null,""]
[null,""]
[null,""]
[null,""]
[null,""]
[null,""]
[null,""]
[null,{"$f":"IF(C141=\"\",\"\",B140+1)","v":""}]
[null,""]
[null,""]
[null,""]
[null,""]
[null,""]
[null,""]
[null,""]
[null,""]
[null,""]
[null,""]
[null,""]
[null,""]
[null,""]
[null,""]
[null,""]
[null,""]
[null,""]
[null,""]
[null,""]
[null,""]
[null,""]
[null,""]
[null,""]
[null,""]
[null,""]
[null,""]
[null,""]
[null,""]
[null,""]
[null,""]
[null,""]
[null,""]
[null,""]
[null,""]
[null,""]
[null,""]
[null,""]
[null,""]
[null,""]
[null,""]
[null,""]
[null,""]
[null,""]
[null,""]
[null,""]
[null,""]
[null,""]
[null,""]
[null,""]
[null,""]
[null,""]
[null,""]
[null,""]
[null,""]
[null,""]
[null,""]
[null,""]
[null,""]
[null,""]
[null,""]
[null,""]
[null,""]
[null,""]
[null,{"$f":"IF(C205=\"\",\"\",B204+1)","v":""}]
[null,""]
[null,""]
[null,""]
[null,""]
[null,""]
[null,""]
[null,""]
[null,""]
[null,""]
[null,""]
[null,""]
[null,""]
[null,""]
[null,""]
[null,""]
[null,""]
[null,""]
[null,""]
[null,""]
[null,""]
[null,""]
[null,""]
[null,""]
[null,""]
[null,""]
[null,""]
[null,""]
[null,""]
[null,""]
[null,""]
[null,""]
[null,""]
[null,""]
[null,""]
[null,""]
[null,""]
[null,""]
[null,""]
[null,""]
[null,""]
[null,""]
[null,""]
[null,""]
[null,""]
[null,""]
[null,""]
[null,""]
[null,""]
[null,""]
[null,""]
[null,""]
[null,""]
[null,""]
[null,""]
[null,""]
[null,""]
[null,""]
[null,""]
[null,""]
[null,""]
[null,""]
[null,""]
[null,""]
[null,{"$f":"IF(C269=\"\",\"\",B268+1)","v":""}]
[null,""]
[null,""]
[null,""]
[null,""]
[null,""]
[null,""]
[null,""]
[null,""]
[null,""]
[null,""]
[null,""]
[null,""]
[null,""]
[null,""]
[null,""]
[null,""]
[null,""]
[null,""]
[null,""]
[null,""]
[null,""]
[null,""]
[null,""]
[null,""]
[null,""]
[null,""]
[null,""]
[null,""]
[null,""]
[null,""]
[null,""]
[null,""]
[null,""]
[null,""]
[null,""]
[null,""]
[null,""]
[null,""]
[null,""]
[null,""]
[null,""]
[null,""]
[null,""]
[null,""]
[null,""]
[null,""]
[null,""]
[null,""]
[null,""]
[null,""]
[null,""]
[null,""]
[null,""]
[null,""]
[null,""]
[null,""]
[null,""]
[null,""]
[null,""]
[null,""]
[null,""]
[null,""]
[null,""]
[null,{"$f":"IF(C333=\"\",\"\",B332+1)","v":""}]
[null,""]
[null,""]
[null,""]
[null,""]
[null,""]
[null,""]
[null,""]
[null,""]
[null,""]
[null,""]
[null,""]
[null,""]
[null,""]
[null,""]
[null,""]
[null,""]
[null,""]
[null,""]
[null,""]
[null,""]
[null,""]
[null,""]
[null,""]
[null,""]
[null,""]
[null,""]
[null,""]
[null,""]
[null,""]
[null,""]
[null,""]
[null,""]
[null,""]
[null,""]
[null,""]
[null,""]
[null,""]
[null,""]
[null,""]
[null,""]
[null,""]
[null,""]
[null,""]
[null,""]
[null,""]
[null,""]
[null,""]
[null,""]
[null,""]
[null,""]
[null,""]
[null,""]
[null,""]
[null,""]
[null,""]
[null,""]
[null,""]
[null,""]
[null,""]
[null,""]
[null,""]
[null,""]
[null,""]
[null,{"$f":"IF(C397=\"\",\"\",B396+1)","v":""}]
[null,""]
[null,""]
[null,""]
[null,""]
[null,""]
[null,""]
[null,""]
[null,""]
[null,""]
[null,""]
[null,""]
[null,""]
[null,""]
[null,""]
[null,""]
[null,""]
[null,""]
[null,""]
[null,""]
[null,""]
[null,""]
[null,""]
[null,""]
[null,""]
[null,""]
[null,""]
[null,""]
[null,""]
[null,""]
[null,""]
[null,""]
[null,""]
[null,""]
[null,""]
[null,""]
[null,""]
[null,""]
[null,""]
[null,""]
[null,""]
[null,""]
[null,""]
[null,""]
[null,""]
[null,""]
[null,""]
[null,""]
[null,""]
[null,""]
[null,""]
[null,""]
[null,""]
[null,""]
[null,""]
[null,""]
[null,""]
[null,""]
[null,""]
[null,""]
[null,""]
[null,""]
[null,""]
[null,""]
[null,{"$f":"IF(C461=\"\",\"\",B460+1)","v":""}]
[null,""]
[null,""]
[null,""]
[null,""]
[null,""]
[null,""]
[null,""]
[null,""]
[null,""]
[null,""]
[null,""]
[null,""]
[null,""]
[null,""]
[null,""]
[null,""]
[null,""]
[null,""]
[null,""]
[null,""]
[null,""]
[null,""]
[null,""]
[null,""]
[null,""]
[null,""]
[null,""]
[null,""]
[null,""]
[null,""]
[null,""]
[null,""]
[null,""]
[null,""]
[null,""]
[null,""]
[null,""]
[null,""]
[null,""]
[null,""]
[null,""]
[null,""]
[null,""]
[null,""]
[null,""]
[null,""]
[null,""]
[null,""]
[null,""]
[]
[null,null,null,null,null,null,null,null,null,null,null,null,null,null,null,null,null,null,null,null,null,null,null,null,null,null,null,null,null,null,null,null,null,null,"Totais pagas",{"$f":"SUM(AJ11:AJ510)","v":0},{"$f":"SUM(AK11:AK510)","v":0},0,0,0,{"$f":"SUM(AO11:AO510)","v":0}]

{"sheet":"Guia 12","index":11,"n_rows":512,"n_cols":46,"rows_kept":512,"cut":false,"hidden":true,"merged":[[4,2,4,8],[5,4,5,7],[6,2,6,5],[6,6,6,9],[6,10,6,11],[7,19,8,19],[6,15,6,22],[6,23,6,34],[6,35,6,45],[7,2,8,2],[7,3,8,3],[7,4,8,4],[7,5,8,5],[7,6,8,6],[7,7,8,7],[7,8,8,8],[6,14,8,14],[7,9,8,9],[7,10,8,10],[7,11,8,11],[7,12,8,12],[7,13,8,13],[7,15,8,15],[7,16,8,16],[7,17,8,17],[7,18,8,18],[7,35,7,40],[7,41,7,43],[7,44,7,45],[7,20,8,20],[7,21,8,21],[7,22,8,22],[7,23,7,28],[7,29,7,31],[7,32,7,34]]}
[]
[null,null,"Superior Tribunal de Justiça"]
[null,null,"Secretaria de Processamento de Feitos"]
[null,null,"Coordenadoria de Processamento de Feitos em Execução Judicial"]
[null,null,{"$f":"\"Relação das Requisições de Pequeno Valor - RPV pagas pelo STJ em \"&IF(F11=\"\",\"\",UPPER((TEXT(F11,\"mmmm/aaaa\"))))","v":"Relação das Requisições de Pequeno Valor - RPV pagas pelo STJ em "}]
[]
[null,null,"RPV",null,null,null,"P R O C E S S O     D E     O R I G E M",null,null,null,"E N T I D A D E S",null,"R E Q U E R E N T E","A D V O G A D O","Natureza do crédito","I N D I C A D O R E S",null,null,null,null,null,null,null,"VALORES REQUISITADOS",null,null,null,null,null,null,null,null,null,null,null,"VALORES ATUALIZADOS PARA PAGAMENTO"]
[null,null,"Nº","Registro","Autuada em","data do pgto","Ação","Autuada em","Tipo de causa","Trânsito","Entidade devedora","Órgão de origem","Origem do crédito","Origem do crédito",null,"Tributário","EC 94 2016","Lei 13.463 2017","PRC/RPV de origem","Nº DA GRU","DOENÇA GRAVE","Deficiência física","Isento de IR","Beneficiários",null,null,null,null,null,"PSSS",null,null,"R R A",null,null,"Beneficiários",null,null,null,null,null,"P S S S",null,null,"R R A"]
[null,null,null,null,null,null,null,null,null,null,null,null,null,null,null,null,null,null,null,null,null,null,null,"Total","Adv I","Adv II","Adv III","Adv IV","Requerente","Base","Desc","Patronal","NMA","Exercícios anteriores","Desconto","Total","Adv I","Adv II","Adv III","Adv IV","Reqte","BASE desc","Desc","Patronal","Exercícios anteriores","Dedução"]
[]
[null,{"$f":"IF(C11=\"\",\"\",1)","v":""}]
[null,{"$f":"IF(C12=\"\",\"\",B11+1)","v":""}]
[null,{"$f":"IF(C13=\"\",\"\",B12+1)","v":""}]
[null,""]
[null,""]
[null,""]
[null,""]
[null,""]
[null,""]
[null,""]
[null,""]
[null,""]
[null,""]
[null,""]
[null,""]
[null,""]
[null,""]
[null,""]
[null,""]
[null,""]
[null,""]
[null,""]
[null,""]
[null,""]
[null,""]
[null,""]
[null,""]
[null,""]
[null,""]
[null,""]
[null,""]
[null,""]
[null,""]
[null,""]
[null,""]
[null,""]
[null,""]
[null,""]
[null,""]
[null,""]
[null,""]
[null,""]
[null,""]
[null,""]
[null,""]
[null,""]
[null,""]
[null,""]
[null,""]
[null,""]
[null,""]
[null,""]
[null,""]
[null,""]
[null,""]
[null,""]
[null,""]
[null,""]
[null,""]
[null,""]
[null,""]
[null,""]
[null,""]
[null,""]
[null,""]
[null,""]
[null,{"$f":"IF(C77=\"\",\"\",B76+1)","v":""}]
[null,""]
[null,""]
[null,""]
[null,""]
[null,""]
[null,""]
[null,""]
[null,""]
[null,""]
[null,""]
[null,""]
[null,""]
[null,""]
[null,""]
[null,""]
[null,""]
[null,""]
[null,""]
[null,""]
[null,""]
[null,""]
[null,""]
[null,""]
[null,""]
[null,""]
[null,""]
[null,""]
[null,""]
[null,""]
[null,""]
[null,""]
[null,""]
[null,""]
[null,""]
[null,""]
[null,""]
[null,""]
[null,""]
[null,""]
[null,""]
[null,""]
[null,""]
[null,""]
[null,""]
[null,""]
[null,""]
[null,""]
[null,""]
[null,""]
[null,""]
[null,""]
[null,""]
[null,""]
[null,""]
[null,""]
[null,""]
[null,""]
[null,""]
[null,""]
[null,""]
[null,""]
[null,""]
[null,""]
[null,{"$f":"IF(C141=\"\",\"\",B140+1)","v":""}]
[null,""]
[null,""]
[null,""]
[null,""]
[null,""]
[null,""]
[null,""]
[null,""]
[null,""]
[null,""]
[null,""]
[null,""]
[null,""]
[null,""]
[null,""]
[null,""]
[null,""]
[null,""]
[null,""]
[null,""]
[null,""]
[null,""]
[null,""]
[null,""]
[null,""]
[null,""]
[null,""]
[null,""]
[null,""]
[null,""]
[null,""]
[null,""]
[null,""]
[null,""]
[null,""]
[null,""]
[null,""]
[null,""]
[null,""]
[null,""]
[null,""]
[null,""]
[null,""]
[null,""]
[null,""]
[null,""]
[null,""]
[null,""]
[null,""]
[null,""]
[null,""]
[null,""]
[null,""]
[null,""]
[null,""]
[null,""]
[null,""]
[null,""]
[null,""]
[null,""]
[null,""]
[null,""]
[null,""]
[null,{"$f":"IF(C205=\"\",\"\",B204+1)","v":""}]
[null,""]
[null,""]
[null,""]
[null,""]
[null,""]
[null,""]
[null,""]
[null,""]
[null,""]
[null,""]
[null,""]
[null,""]
[null,""]
[null,""]
[null,""]
[null,""]
[null,""]
[null,""]
[null,""]
[null,""]
[null,""]
[null,""]
[null,""]
[null,""]
[null,""]
[null,""]
[null,""]
[null,""]
[null,""]
[null,""]
[null,""]
[null,""]
[null,""]
[null,""]
[null,""]
[null,""]
[null,""]
[null,""]
[null,""]
[null,""]
[null,""]
[null,""]
[null,""]
[null,""]
[null,""]
[null,""]
[null,""]
[null,""]
[null,""]
[null,""]
[null,""]
[null,""]
[null,""]
[null,""]
[null,""]
[null,""]
[null,""]
[null,""]
[null,""]
[null,""]
[null,""]
[null,""]
[null,""]
[null,{"$f":"IF(C269=\"\",\"\",B268+1)","v":""}]
[null,""]
[null,""]
[null,""]
[null,""]
[null,""]
[null,""]
[null,""]
[null,""]
[null,""]
[null,""]
[null,""]
[null,""]
[null,""]
[null,""]
[null,""]
[null,""]
[null,""]
[null,""]
[null,""]
[null,""]
[null,""]
[null,""]
[null,""]
[null,""]
[null,""]
[null,""]
[null,""]
[null,""]
[null,""]
[null,""]
[null,""]
[null,""]
[null,""]
[null,""]
[null,""]
[null,""]
[null,""]
[null,""]
[null,""]
[null,""]
[null,""]
[null,""]
[null,""]
[null,""]
[null,""]
[null,""]
[null,""]
[null,""]
[null,""]
[null,""]
[null,""]
[null,""]
[null,""]
[null,""]
[null,""]
[null,""]
[null,""]
[null,""]
[null,""]
[null,""]
[null,""]
[null,""]
[null,""]
[null,{"$f":"IF(C333=\"\",\"\",B332+1)","v":""}]
[null,""]
[null,""]
[null,""]
[null,""]
[null,""]
[null,""]
[null,""]
[null,""]
[null,""]
[null,""]
[null,""]
[null,""]
[null,""]
[null,""]
[null,""]
[null,""]
[null,""]
[null,""]
[null,""]
[null,""]
[null,""]
[null,""]
[null,""]
[null,""]
[null,""]
[null,""]
[null,""]
[null,""]
[null,""]
[null,""]
[null,""]
[null,""]
[null,""]
[null,""]
[null,""]
[null,""]
[null,""]
[null,""]
[null,""]
[null,""]
[null,""]
[null,""]
[null,""]
[null,""]
[null,""]
[null,""]
[null,""]
[null,""]
[null,""]
[null,""]
[null,""]
[null,""]
[null,""]
[null,""]
[null,""]
[null,""]
[null,""]
[null,""]
[null,""]
[null,""]
[null,""]
[null,""]
[null,""]
[null,{"$f":"IF(C397=\"\",\"\",B396+1)","v":""}]
[null,""]
[null,""]
[null,""]
[null,""]
[null,""]
[null,""]
[null,""]
[null,""]
[null,""]
[null,""]
[null,""]
[null,""]
[null,""]
[null,""]
[null,""]
[null,""]
[null,""]
[null,""]
[null,""]
[null,""]
[null,""]
[null,""]
[null,""]
[null,""]
[null,""]
[null,""]
[null,""]
[null,""]
[null,""]
[null,""]
[null,""]
[null,""]
[null,""]
[null,""]
[null,""]
[null,""]
[null,""]
[null,""]
[null,""]
[null,""]
[null,""]
[null,""]
[null,""]
[null,""]
[null,""]
[null,""]
[null,""]
[null,""]
[null,""]
[null,""]
[null,""]
[null,""]
[null,""]
[null,""]
[null,""]
[null,""]
[null,""]
[null,""]
[null,""]
[null,""]
[null,""]
[null,""]
[null,""]
[null,{"$f":"IF(C461=\"\",\"\",B460+1)","v":""}]
[null,""]
[null,""]
[null,""]
[null,""]
[null,""]
[null,""]
[null,""]
[null,""]
[null,""]
[null,""]
[null,""]
[null,""]
[null,""]
[null,""]
[null,""]
[null,""]
[null,""]
[null,""]
[null,""]
[null,""]
[null,""]
[null,""]
[null,""]
[null,""]
[null,""]
[null,""]
[null,""]
[null,""]
[null,""]
[null,""]
[null,""]
[null,""]
[null,""]
[null,""]
[null,""]
[null,""]
[null,""]
[null,""]
[null,""]
[null,""]
[null,""]
[null,""]
[null,""]
[null,""]
[null,""]
[null,""]
[null,""]
[null,""]
[null,""]
[]
[null,null,null,null,null,null,null,null,null,null,null,null,null,null,null,null,null,null,null,null,null,null,null,null,null,null,null,null,null,null,null,null,null,null,"Totais pagas",{"$f":"SUM(AJ11:AJ510)","v":0},{"$f":"SUM(AK11:AK510)","v":0},0,0,0,{"$f":"SUM(AO11:AO510)","v":0}]

{"sheet":"Guia 13","index":12,"n_rows":512,"n_cols":46,"rows_kept":512,"cut":false,"hidden":true,"merged":[[4,2,4,8],[5,4,5,7],[6,2,6,5],[6,6,6,9],[6,10,6,11],[7,19,8,19],[6,15,6,22],[6,23,6,34],[6,35,6,45],[7,2,8,2],[7,3,8,3],[7,4,8,4],[7,5,8,5],[7,6,8,6],[7,7,8,7],[7,8,8,8],[6,14,8,14],[7,9,8,9],[7,10,8,10],[7,11,8,11],[7,12,8,12],[7,13,8,13],[7,15,8,15],[7,16,8,16],[7,17,8,17],[7,18,8,18],[7,35,7,40],[7,41,7,43],[7,44,7,45],[7,20,8,20],[7,21,8,21],[7,22,8,22],[7,23,7,28],[7,29,7,31],[7,32,7,34]]}
[]
[null,null,"Superior Tribunal de Justiça"]
[null,null,"Secretaria de Processamento de Feitos"]
[null,null,"Coordenadoria de Processamento de Feitos em Execução Judicial"]
[null,null,{"$f":"\"Relação das Requisições de Pequeno Valor - RPV pagas pelo STJ em \"&IF(F11=\"\",\"\",UPPER((TEXT(F11,\"mmmm/aaaa\"))))","v":"Relação das Requisições de Pequeno Valor - RPV pagas pelo STJ em "}]
[]
[null,null,"RPV",null,null,null,"P R O C E S S O     D E     O R I G E M",null,null,null,"E N T I D A D E S",null,"R E Q U E R E N T E","A D V O G A D O","Natureza do crédito","I N D I C A D O R E S",null,null,null,null,null,null,null,"VALORES REQUISITADOS",null,null,null,null,null,null,null,null,null,null,null,"VALORES ATUALIZADOS PARA PAGAMENTO"]
[null,null,"Nº","Registro","Autuada em","data do pgto","Ação","Autuada em","Tipo de causa","Trânsito","Entidade devedora","Órgão de origem","Origem do crédito","Origem do crédito",null,"Tributário","EC 94 2016","Lei 13.463 2017","PRC/RPV de origem","Nº DA GRU","DOENÇA GRAVE","Deficiência física","Isento de IR","Beneficiários",null,null,null,null,null,"PSSS",null,null,"R R A",null,null,"Beneficiários",null,null,null,null,null,"P S S S",null,null,"R R A"]
[null,null,null,null,null,null,null,null,null,null,null,null,null,null,null,null,null,null,null,null,null,null,null,"Total","Adv I","Adv II","Adv III","Adv IV","Requerente","Base","Desc","Patronal","NMA","Exercícios anteriores","Desconto","Total","Adv I","Adv II","Adv III","Adv IV","Reqte","BASE desc","Desc","Patronal","Exercícios anteriores","Dedução"]
[]
[null,{"$f":"IF(C11=\"\",\"\",1)","v":""}]
[null,{"$f":"IF(C12=\"\",\"\",B11+1)","v":""}]
[null,{"$f":"IF(C13=\"\",\"\",B12+1)","v":""}]
[null,""]
[null,""]
[null,""]
[null,""]
[null,""]
[null,""]
[null,""]
[null,""]
[null,""]
[null,""]
[null,""]
[null,""]
[null,""]
[null,""]
[null,""]
[null,""]
[null,""]
[null,""]
[null,""]
[null,""]
[null,""]
[null,""]
[null,""]
[null,""]
[null,""]
[null,""]
[null,""]
[null,""]
[null,""]
[null,""]
[null,""]
[null,""]
[null,""]
[null,""]
[null,""]
[null,""]
[null,""]
[null,""]
[null,""]
[null,""]
[null,""]
[null,""]
[null,""]
[null,""]
[null,""]
[null,""]
[null,""]
[null,""]
[null,""]
[null,""]
[null,""]
[null,""]
[null,""]
[null,""]
[null,""]
[null,""]
[null,""]
[null,""]
[null,""]
[null,""]
[null,""]
[null,""]
[null,""]
[null,{"$f":"IF(C77=\"\",\"\",B76+1)","v":""}]
[null,""]
[null,""]
[null,""]
[null,""]
[null,""]
[null,""]
[null,""]
[null,""]
[null,""]
[null,""]
[null,""]
[null,""]
[null,""]
[null,""]
[null,""]
[null,""]
[null,""]
[null,""]
[null,""]
[null,""]
[null,""]
[null,""]
[null,""]
[null,""]
[null,""]
[null,""]
[null,""]
[null,""]
[null,""]
[null,""]
[null,""]
[null,""]
[null,""]
[null,""]
[null,""]
[null,""]
[null,""]
[null,""]
[null,""]
[null,""]
[null,""]
[null,""]
[null,""]
[null,""]
[null,""]
[null,""]
[null,""]
[null,""]
[null,""]
[null,""]
[null,""]
[null,""]
[null,""]
[null,""]
[null,""]
[null,""]
[null,""]
[null,""]
[null,""]
[null,""]
[null,""]
[null,""]
[null,""]
[null,{"$f":"IF(C141=\"\",\"\",B140+1)","v":""}]
[null,""]
[null,""]
[null,""]
[null,""]
[null,""]
[null,""]
[null,""]
[null,""]
[null,""]
[null,""]
[null,""]
[null,""]
[null,""]
[null,""]
[null,""]
[null,""]
[null,""]
[null,""]
[null,""]
[null,""]
[null,""]
[null,""]
[null,""]
[null,""]
[null,""]
[null,""]
[null,""]
[null,""]
[null,""]
[null,""]
[null,""]
[null,""]
[null,""]
[null,""]
[null,""]
[null,""]
[null,""]
[null,""]
[null,""]
[null,""]
[null,""]
[null,""]
[null,""]
[null,""]
[null,""]
[null,""]
[null,""]
[null,""]
[null,""]
[null,""]
[null,""]
[null,""]
[null,""]
[null,""]
[null,""]
[null,""]
[null,""]
[null,""]
[null,""]
[null,""]
[null,""]
[null,""]
[null,""]
[null,{"$f":"IF(C205=\"\",\"\",B204+1)","v":""}]
[null,""]
[null,""]
[null,""]
[null,""]
[null,""]
[null,""]
[null,""]
[null,""]
[null,""]
[null,""]
[null,""]
[null,""]
[null,""]
[null,""]
[null,""]
[null,""]
[null,""]
[null,""]
[null,""]
[null,""]
[null,""]
[null,""]
[null,""]
[null,""]
[null,""]
[null,""]
[null,""]
[null,""]
[null,""]
[null,""]
[null,""]
[null,""]
[null,""]
[null,""]
[null,""]
[null,""]
[null,""]
[null,""]
[null,""]
[null,""]
[null,""]
[null,""]
[null,""]
[null,""]
[null,""]
[null,""]
[null,""]
[null,""]
[null,""]
[null,""]
[null,""]
[null,""]
[null,""]
[null,""]
[null,""]
[null,""]
[null,""]
[null,""]
[null,""]
[null,""]
[null,""]
[null,""]
[null,""]
[null,{"$f":"IF(C269=\"\",\"\",B268+1)","v":""}]
[null,""]
[null,""]
[null,""]
[null,""]
[null,""]
[null,""]
[null,""]
[null,""]
[null,""]
[null,""]
[null,""]
[null,""]
[null,""]
[null,""]
[null,""]
[null,""]
[null,""]
[null,""]
[null,""]
[null,""]
[null,""]
[null,""]
[null,""]
[null,""]
[null,""]
[null,""]
[null,""]
[null,""]
[null,""]
[null,""]
[null,""]
[null,""]
[null,""]
[null,""]
[null,""]
[null,""]
[null,""]
[null,""]
[null,""]
[null,""]
[null,""]
[null,""]
[null,""]
[null,""]
[null,""]
[null,""]
[null,""]
[null,""]
[null,""]
[null,""]
[null,""]
[null,""]
[null,""]
[null,""]
[null,""]
[null,""]
[null,""]
[null,""]
[null,""]
[null,""]
[null,""]
[null,""]
[null,""]
[null,{"$f":"IF(C333=\"\",\"\",B332+1)","v":""}]
[null,""]
[null,""]
[null,""]
[null,""]
[null,""]
[null,""]
[null,""]
[null,""]
[null,""]
[null,""]
[null,""]
[null,""]
[null,""]
[null,""]
[null,""]
[null,""]
[null,""]
[null,""]
[null,""]
[null,""]
[null,""]
[null,""]
[null,""]
[null,""]
[null,""]
[null,""]
[null,""]
[null,""]
[null,""]
[null,""]
[null,""]
[null,""]
[null,""]
[null,""]
[null,""]
[null,""]
[null,""]
[null,""]
[null,""]
[null,""]
[null,""]
[null,""]
[null,""]
[null,""]
[null,""]
[null,""]
[null,""]
[null,""]
[null,""]
[null,""]
[null,""]
[null,""]
[null,""]
[null,""]
[null,""]
[null,""]
[null,""]
[null,""]
[null,""]
[null,""]
[null,""]
[null,""]
[null,""]
[null,{"$f":"IF(C397=\"\",\"\",B396+1)","v":""}]
[null,""]
[null,""]
[null,""]
[null,""]
[null,""]
[null,""]
[null,""]
[null,""]
[null,""]
[null,""]
[null,""]
[null,""]
[null,""]
[null,""]
[null,""]
[null,""]
[null,""]
[null,""]
[null,""]
[null,""]
[null,""]
[null,""]
[null,""]
[null,""]
[null,""]
[null,""]
[null,""]
[null,""]
[null,""]
[null,""]
[null,""]
[null,""]
[null,""]
[null,""]
[null,""]
[null,""]
[null,""]
[null,""]
[null,""]
[null,""]
[null,""]
[null,""]
[null,""]
[null,""]
[null,""]
[null,""]
[null,""]
[null,""]
[null,""]
[null,""]
[null,""]
[null,""]
[null,""]
[null,""]
[null,""]
[null,""]
[null,""]
[null,""]
[null,""]
[null,""]
[null,""]
[null,""]
[null,""]
[null,{"$f":"IF(C461=\"\",\"\",B460+1)","v":""}]
[null,""]
[null,""]
[null,""]
[null,""]
[null,""]
[null,""]
[null,""]
[null,""]
[null,""]
[null,""]
[null,""]
[null,""]
[null,""]
[null,""]
[null,""]
[null,""]
[null,""]
[null,""]
[null,""]
[null,""]
[null,""]
[null,""]
[null,""]
[null,""]
[null,""]
[null,""]
[null,""]
[null,""]
[null,""]
[null,""]
[null,""]
[null,""]
[null,""]
[null,""]
[null,""]
[null,""]
[null,""]
[null,""]
[null,""]
[null,""]
[null,""]
[null,""]
[null,""]
[null,""]
[null,""]
[null,""]
[null,""]
[null,""]
[null,""]
[]
[null,null,null,null,null,null,null,null,null,null,null,null,null,null,null,null,null,null,null,null,null,null,null,null,null,null,null,null,null,null,null,null,null,null,"Totais pagas",{"$f":"SUM(AJ11:AJ510)","v":0},{"$f":"SUM(AK11:AK510)","v":0},0,0,0,{"$f":"SUM(AO11:AO510)","v":0}]

{"sheet":"Guia 14","index":13,"n_rows":512,"n_cols":46,"rows_kept":512,"cut":false,"hidden":true,"merged":[[4,2,4,8],[5,4,5,7],[6,2,6,5],[6,6,6,9],[6,10,6,11],[7,19,8,19],[6,15,6,22],[6,23,6,34],[6,35,6,45],[7,2,8,2],[7,3,8,3],[7,4,8,4],[7,5,8,5],[7,6,8,6],[7,7,8,7],[7,8,8,8],[6,14,8,14],[7,9,8,9],[7,10,8,10],[7,11,8,11],[7,12,8,12],[7,13,8,13],[7,15,8,15],[7,16,8,16],[7,17,8,17],[7,18,8,18],[7,35,7,40],[7,41,7,43],[7,44,7,45],[7,20,8,20],[7,21,8,21],[7,22,8,22],[7,23,7,28],[7,29,7,31],[7,32,7,34]]}
[]
[null,null,"Superior Tribunal de Justiça"]
[null,null,"Secretaria de Processamento de Feitos"]
[null,null,"Coordenadoria de Processamento de Feitos em Execução Judicial"]
[null,null,{"$f":"\"Relação das Requisições de Pequeno Valor - RPV pagas pelo STJ em \"&IF(F11=\"\",\"\",UPPER((TEXT(F11,\"mmmm/aaaa\"))))","v":"Relação das Requisições de Pequeno Valor - RPV pagas pelo STJ em "}]
[]
[null,null,"RPV",null,null,null,"P R O C E S S O     D E     O R I G E M",null,null,null,"E N T I D A D E S",null,"R E Q U E R E N T E","A D V O G A D O","Natureza do crédito","I N D I C A D O R E S",null,null,null,null,null,null,null,"VALORES REQUISITADOS",null,null,null,null,null,null,null,null,null,null,null,"VALORES ATUALIZADOS PARA PAGAMENTO"]
[null,null,"Nº","Registro","Autuada em","data do pgto","Ação","Autuada em","Tipo de causa","Trânsito","Entidade devedora","Órgão de origem","Origem do crédito","Origem do crédito",null,"Tributário","EC 94 2016","Lei 13.463 2017","PRC/RPV de origem","Nº DA GRU","DOENÇA GRAVE","Deficiência física","Isento de IR","Beneficiários",null,null,null,null,null,"PSSS",null,null,"R R A",null,null,"Beneficiários",null,null,null,null,null,"P S S S",null,null,"R R A"]
[null,null,null,null,null,null,null,null,null,null,null,null,null,null,null,null,null,null,null,null,null,null,null,"Total","Adv I","Adv II","Adv III","Adv IV","Requerente","Base","Desc","Patronal","NMA","Exercícios anteriores","Desconto","Total","Adv I","Adv II","Adv III","Adv IV","Reqte","BASE desc","Desc","Patronal","Exercícios anteriores","Dedução"]
[]
[null,{"$f":"IF(C11=\"\",\"\",1)","v":""}]
[null,{"$f":"IF(C12=\"\",\"\",B11+1)","v":""}]
[null,{"$f":"IF(C13=\"\",\"\",B12+1)","v":""}]
[null,""]
[null,""]
[null,""]
[null,""]
[null,""]
[null,""]
[null,""]
[null,""]
[null,""]
[null,""]
[null,""]
[null,""]
[null,""]
[null,""]
[null,""]
[null,""]
[null,""]
[null,""]
[null,""]
[null,""]
[null,""]
[null,""]
[null,""]
[null,""]
[null,""]
[null,""]
[null,""]
[null,""]
[null,""]
[null,""]
[null,""]
[null,""]
[null,""]
[null,""]
[null,""]
[null,""]
[null,""]
[null,""]
[null,""]
[null,""]
[null,""]
[null,""]
[null,""]
[null,""]
[null,""]
[null,""]
[null,""]
[null,""]
[null,""]
[null,""]
[null,""]
[null,""]
[null,""]
[null,""]
[null,""]
[null,""]
[null,""]
[null,""]
[null,""]
[null,""]
[null,""]
[null,""]
[null,""]
[null,{"$f":"IF(C77=\"\",\"\",B76+1)","v":""}]
[null,""]
[null,""]
[null,""]
[null,""]
[null,""]
[null,""]
[null,""]
[null,""]
[null,""]
[null,""]
[null,""]
[null,""]
[null,""]
[null,""]
[null,""]
[null,""]
[null,""]
[null,""]
[null,""]
[null,""]
[null,""]
[null,""]
[null,""]
[null,""]
[null,""]
[null,""]
[null,""]
[null,""]
[null,""]
[null,""]
[null,""]
[null,""]
[null,""]
[null,""]
[null,""]
[null,""]
[null,""]
[null,""]
[null,""]
[null,""]
[null,""]
[null,""]
[null,""]
[null,""]
[null,""]
[null,""]
[null,""]
[null,""]
[null,""]
[null,""]
[null,""]
[null,""]
[null,""]
[null,""]
[null,""]
[null,""]
[null,""]
[null,""]
[null,""]
[null,""]
[null,""]
[null,""]
[null,""]
[null,{"$f":"IF(C141=\"\",\"\",B140+1)","v":""}]
[null,""]
[null,""]
[null,""]
[null,""]
[null,""]
[null,""]
[null,""]
[null,""]
[null,""]
[null,""]
[null,""]
[null,""]
[null,""]
[null,""]
[null,""]
[null,""]
[null,""]
[null,""]
[null,""]
[null,""]
[null,""]
[null,""]
[null,""]
[null,""]
[null,""]
[null,""]
[null,""]
[null,""]
[null,""]
[null,""]
[null,""]
[null,""]
[null,""]
[null,""]
[null,""]
[null,""]
[null,""]
[null,""]
[null,""]
[null,""]
[null,""]
[null,""]
[null,""]
[null,""]
[null,""]
[null,""]
[null,""]
[null,""]
[null,""]
[null,""]
[null,""]
[null,""]
[null,""]
[null,""]
[null,""]
[null,""]
[null,""]
[null,""]
[null,""]
[null,""]
[null,""]
[null,""]
[null,""]
[null,{"$f":"IF(C205=\"\",\"\",B204+1)","v":""}]
[null,""]
[null,""]
[null,""]
[null,""]
[null,""]
[null,""]
[null,""]
[null,""]
[null,""]
[null,""]
[null,""]
[null,""]
[null,""]
[null,""]
[null,""]
[null,""]
[null,""]
[null,""]
[null,""]
[null,""]
[null,""]
[null,""]
[null,""]
[null,""]
[null,""]
[null,""]
[null,""]
[null,""]
[null,""]
[null,""]
[null,""]
[null,""]
[null,""]
[null,""]
[null,""]
[null,""]
[null,""]
[null,""]
[null,""]
[null,""]
[null,""]
[null,""]
[null,""]
[null,""]
[null,""]
[null,""]
[null,""]
[null,""]
[null,""]
[null,""]
[null,""]
[null,""]
[null,""]
[null,""]
[null,""]
[null,""]
[null,""]
[null,""]
[null,""]
[null,""]
[null,""]
[null,""]
[null,""]
[null,{"$f":"IF(C269=\"\",\"\",B268+1)","v":""}]
[null,""]
[null,""]
[null,""]
[null,""]
[null,""]
[null,""]
[null,""]
[null,""]
[null,""]
[null,""]
[null,""]
[null,""]
[null,""]
[null,""]
[null,""]
[null,""]
[null,""]
[null,""]
[null,""]
[null,""]
[null,""]
[null,""]
[null,""]
[null,""]
[null,""]
[null,""]
[null,""]
[null,""]
[null,""]
[null,""]
[null,""]
[null,""]
[null,""]
[null,""]
[null,""]
[null,""]
[null,""]
[null,""]
[null,""]
[null,""]
[null,""]
[null,""]
[null,""]
[null,""]
[null,""]
[null,""]
[null,""]
[null,""]
[null,""]
[null,""]
[null,""]
[null,""]
[null,""]
[null,""]
[null,""]
[null,""]
[null,""]
[null,""]
[null,""]
[null,""]
[null,""]
[null,""]
[null,""]
[null,{"$f":"IF(C333=\"\",\"\",B332+1)","v":""}]
[null,""]
[null,""]
[null,""]
[null,""]
[null,""]
[null,""]
[null,""]
[null,""]
[null,""]
[null,""]
[null,""]
[null,""]
[null,""]
[null,""]
[null,""]
[null,""]
[null,""]
[null,""]
[null,""]
[null,""]
[null,""]
[null,""]
[null,""]
[null,""]
[null,""]
[null,""]
[null,""]
[null,""]
[null,""]
[null,""]
[null,""]
[null,""]
[null,""]
[null,""]
[null,""]
[null,""]
[null,""]
[null,""]
[null,""]
[null,""]
[null,""]
[null,""]
[null,""]
[null,""]
[null,""]
[null,""]
[null,""]
[null,""]
[null,""]
[null,""]
[null,""]
[null,""]
[null,""]
[null,""]
[null,""]
[null,""]
[null,""]
[null,""]
[null,""]
[null,""]
[null,""]
[null,""]
[null,""]
[null,{"$f":"IF(C397=\"\",\"\",B396+1)","v":""}]
[null,""]
[null,""]
[null,""]
[null,""]
[null,""]
[null,""]
[null,""]
[null,""]
[null,""]
[null,""]
[null,""]
[null,""]
[null,""]
[null,""]
[null,""]
[null,""]
[null,""]
[null,""]
[null,""]
[null,""]
[null,""]
[null,""]
[null,""]
[null,""]
[null,""]
[null,""]
[null,""]
[null,""]
[null,""]
[null,""]
[null,""]
[null,""]
[null,""]
[null,""]
[null,""]
[null,""]
[null,""]
[null,""]
[null,""]
[null,""]
[null,""]
[null,""]
[null,""]
[null,""]
[null,""]
[null,""]
[null,""]
[null,""]
[null,""]
[null,""]
[null,""]
[null,""]
[null,""]
[null,""]
[null,""]
[null,""]
[null,""]
[null,""]
[null,""]
[null,""]
[null,""]
[null,""]
[null,""]
[null,{"$f":"IF(C461=\"\",\"\",B460+1)","v":""}]
[null,""]
[null,""]
[null,""]
[null,""]
[null,""]
[null,""]
[null,""]
[null,""]
[null,""]
[null,""]
[null,""]
[null,""]
[null,""]
[null,""]
[null,""]
[null,""]
[null,""]
[null,""]
[null,""]
[null,""]
[null,""]
[null,""]
[null,""]
[null,""]
[null,""]
[null,""]
[null,""]
[null,""]
[null,""]
[null,""]
[null,""]
[null,""]
[null,""]
[null,""]
[null,""]
[null,""]
[null,""]
[null,""]
[null,""]
[null,""]
[null,""]
[null,""]
[null,""]
[null,""]
[null,""]
[null,""]
[null,""]
[null,""]
[null,""]
[]
[null,null,null,null,null,null,null,null,null,null,null,null,null,null,null,null,null,null,null,null,null,null,null,null,null,null,null,null,null,null,null,null,null,null,"Totais pagas",{"$f":"SUM(AJ11:AJ510)","v":0},{"$f":"SUM(AK11:AK510)","v":0},0,0,0,{"$f":"SUM(AO11:AO510)","v":0}]

{"sheet":"Guia 15","index":14,"n_rows":512,"n_cols":46,"rows_kept":512,"cut":false,"hidden":true,"merged":[[4,2,4,8],[5,4,5,7],[6,2,6,5],[6,6,6,9],[6,10,6,11],[7,19,8,19],[6,15,6,22],[6,23,6,34],[6,35,6,45],[7,2,8,2],[7,3,8,3],[7,4,8,4],[7,5,8,5],[7,6,8,6],[7,7,8,7],[7,8,8,8],[6,14,8,14],[7,9,8,9],[7,10,8,10],[7,11,8,11],[7,12,8,12],[7,13,8,13],[7,15,8,15],[7,16,8,16],[7,17,8,17],[7,18,8,18],[7,35,7,40],[7,41,7,43],[7,44,7,45],[7,20,8,20],[7,21,8,21],[7,22,8,22],[7,23,7,28],[7,29,7,31],[7,32,7,34]]}
[]
[null,null,"Superior Tribunal de Justiça"]
[null,null,"Secretaria de Processamento de Feitos"]
[null,null,"Coordenadoria de Processamento de Feitos em Execução Judicial"]
[null,null,{"$f":"\"Relação das Requisições de Pequeno Valor - RPV pagas pelo STJ em \"&IF(F11=\"\",\"\",UPPER((TEXT(F11,\"mmmm/aaaa\"))))","v":"Relação das Requisições de Pequeno Valor - RPV pagas pelo STJ em "}]
[]
[null,null,"RPV",null,null,null,"P R O C E S S O     D E     O R I G E M",null,null,null,"E N T I D A D E S",null,"R E Q U E R E N T E","A D V O G A D O","Natureza do crédito","I N D I C A D O R E S",null,null,null,null,null,null,null,"VALORES REQUISITADOS",null,null,null,null,null,null,null,null,null,null,null,"VALORES ATUALIZADOS PARA PAGAMENTO"]
[null,null,"Nº","Registro","Autuada em","data do pgto","Ação","Autuada em","Tipo de causa","Trânsito","Entidade devedora","Órgão de origem","Origem do crédito","Origem do crédito",null,"Tributário","EC 94 2016","Lei 13.463 2017","PRC/RPV de origem","Nº DA GRU","DOENÇA GRAVE","Deficiência física","Isento de IR","Beneficiários",null,null,null,null,null,"PSSS",null,null,"R R A",null,null,"Beneficiários",null,null,null,null,null,"P S S S",null,null,"R R A"]
[null,null,null,null,null,null,null,null,null,null,null,null,null,null,null,null,null,null,null,null,null,null,null,"Total","Adv I","Adv II","Adv III","Adv IV","Requerente","Base","Desc","Patronal","NMA","Exercícios anteriores","Desconto","Total","Adv I","Adv II","Adv III","Adv IV","Reqte","BASE desc","Desc","Patronal","Exercícios anteriores","Dedução"]
[]
[null,{"$f":"IF(C11=\"\",\"\",1)","v":""}]
[null,{"$f":"IF(C12=\"\",\"\",B11+1)","v":""}]
[null,{"$f":"IF(C13=\"\",\"\",B12+1)","v":""}]
[null,""]
[null,""]
[null,""]
[null,""]
[null,""]
[null,""]
[null,""]
[null,""]
[null,""]
[null,""]
[null,""]
[null,""]
[null,""]
[null,""]
[null,""]
[null,""]
[null,""]
[null,""]
[null,""]
[null,""]
[null,""]
[null,""]
[null,""]
[null,""]
[null,""]
[null,""]
[null,""]
[null,""]
[null,""]
[null,""]
[null,""]
[null,""]
[null,""]
[null,""]
[null,""]
[null,""]
[null,""]
[null,""]
[null,""]
[null,""]
[null,""]
[null,""]
[null,""]
[null,""]
[null,""]
[null,""]
[null,""]
[null,""]
[null,""]
[null,""]
[null,""]
[null,""]
[null,""]
[null,""]
[null,""]
[null,""]
[null,""]
[null,""]
[null,""]
[null,""]
[null,""]
[null,""]
[null,""]
[null,{"$f":"IF(C77=\"\",\"\",B76+1)","v":""}]
[null,""]
[null,""]
[null,""]
[null,""]
[null,""]
[null,""]
[null,""]
[null,""]
[null,""]
[null,""]
[null,""]
[null,""]
[null,""]
[null,""]
[null,""]
[null,""]
[null,""]
[null,""]
[null,""]
[null,""]
[null,""]
[null,""]
[null,""]
[null,""]
[null,""]
[null,""]
[null,""]
[null,""]
[null,""]
[null,""]
[null,""]
[null,""]
[null,""]
[null,""]
[null,""]
[null,""]
[null,""]
[null,""]
[null,""]
[null,""]
[null,""]
[null,""]
[null,""]
[null,""]
[null,""]
[null,""]
[null,""]
[null,""]
[null,""]
[null,""]
[null,""]
[null,""]
[null,""]
[null,""]
[null,""]
[null,""]
[null,""]
[null,""]
[null,""]
[null,""]
[null,""]
[null,""]
[null,""]
[null,{"$f":"IF(C141=\"\",\"\",B140+1)","v":""}]
[null,""]
[null,""]
[null,""]
[null,""]
[null,""]
[null,""]
[null,""]
[null,""]
[null,""]
[null,""]
[null,""]
[null,""]
[null,""]
[null,""]
[null,""]
[null,""]
[null,""]
[null,""]
[null,""]
[null,""]
[null,""]
[null,""]
[null,""]
[null,""]
[null,""]
[null,""]
[null,""]
[null,""]
[null,""]
[null,""]
[null,""]
[null,""]
[null,""]
[null,""]
[null,""]
[null,""]
[null,""]
[null,""]
[null,""]
[null,""]
[null,""]
[null,""]
[null,""]
[null,""]
[null,""]
[null,""]
[null,""]
[null,""]
[null,""]
[null,""]
[null,""]
[null,""]
[null,""]
[null,""]
[null,""]
[null,""]
[null,""]
[null,""]
[null,""]
[null,""]
[null,""]
[null,""]
[null,""]
[null,{"$f":"IF(C205=\"\",\"\",B204+1)","v":""}]
[null,""]
[null,""]
[null,""]
[null,""]
[null,""]
[null,""]
[null,""]
[null,""]
[null,""]
[null,""]
[null,""]
[null,""]
[null,""]
[null,""]
[null,""]
[null,""]
[null,""]
[null,""]
[null,""]
[null,""]
[null,""]
[null,""]
[null,""]
[null,""]
[null,""]
[null,""]
[null,""]
[null,""]
[null,""]
[null,""]
[null,""]
[null,""]
[null,""]
[null,""]
[null,""]
[null,""]
[null,""]
[null,""]
[null,""]
[null,""]
[null,""]
[null,""]
[null,""]
[null,""]
[null,""]
[null,""]
[null,""]
[null,""]
[null,""]
[null,""]
[null,""]
[null,""]
[null,""]
[null,""]
[null,""]
[null,""]
[null,""]
[null,""]
[null,""]
[null,""]
[null,""]
[null,""]
[null,""]
[null,{"$f":"IF(C269=\"\",\"\",B268+1)","v":""}]
[null,""]
[null,""]
[null,""]
[null,""]
[null,""]
[null,""]
[null,""]
[null,""]
[null,""]
[null,""]
[null,""]
[null,""]
[null,""]
[null,""]
[null,""]
[null,""]
[null,""]
[null,""]
[null,""]
[null,""]
[null,""]
[null,""]
[null,""]
[null,""]
[null,""]
[null,""]
[null,""]
[null,""]
[null,""]
[null,""]
[null,""]
[null,""]
[null,""]
[null,""]
[null,""]
[null,""]
[null,""]
[null,""]
[null,""]
[null,""]
[null,""]
[null,""]
[null,""]
[null,""]
[null,""]
[null,""]
[null,""]
[null,""]
[null,""]
[null,""]
[null,""]
[null,""]
[null,""]
[null,""]
[null,""]
[null,""]
[null,""]
[null,""]
[null,""]
[null,""]
[null,""]
[null,""]
[null,""]
[null,{"$f":"IF(C333=\"\",\"\",B332+1)","v":""}]
[null,""]
[null,""]
[null,""]
[null,""]
[null,""]
[null,""]
[null,""]
[null,""]
[null,""]
[null,""]
[null,""]
[null,""]
[null,""]
[null,""]
[null,""]
[null,""]
[null,""]
[null,""]
[null,""]
[null,""]
[null,""]
[null,""]
[null,""]
[null,""]
[null,""]
[null,""]
[null,""]
[null,""]
[null,""]
[null,""]
[null,""]
[null,""]
[null,""]
[null,""]
[null,""]
[null,""]
[null,""]
[null,""]
[null,""]
[null,""]
[null,""]
[null,""]
[null,""]
[null,""]
[null,""]
[null,""]
[null,""]
[null,""]
[null,""]
[null,""]
[null,""]
[null,""]
[null,""]
[null,""]
[null,""]
[null,""]
[null,""]
[null,""]
[null,""]
[null,""]
[null,""]
[null,""]
[null,""]
[null,{"$f":"IF(C397=\"\",\"\",B396+1)","v":""}]
[null,""]
[null,""]
[null,""]
[null,""]
[null,""]
[null,""]
[null,""]
[null,""]
[null,""]
[null,""]
[null,""]
[null,""]
[null,""]
[null,""]
[null,""]
[null,""]
[null,""]
[null,""]
[null,""]
[null,""]
[null,""]
[null,""]
[null,""]
[null,""]
[null,""]
[null,""]
[null,""]
[null,""]
[null,""]
[null,""]
[null,""]
[null,""]
[null,""]
[null,""]
[null,""]
[null,""]
[null,""]
[null,""]
[null,""]
[null,""]
[null,""]
[null,""]
[null,""]
[null,""]
[null,""]
[null,""]
[null,""]
[null,""]
[null,""]
[null,""]
[null,""]
[null,""]
[null,""]
[null,""]
[null,""]
[null,""]
[null,""]
[null,""]
[null,""]
[null,""]
[null,""]
[null,""]
[null,""]
[null,{"$f":"IF(C461=\"\",\"\",B460+1)","v":""}]
[null,""]
[null,""]
[null,""]
[null,""]
[null,""]
[null,""]
[null,""]
[null,""]
[null,""]
[null,""]
[null,""]
[null,""]
[null,""]
[null,""]
[null,""]
[null,""]
[null,""]
[null,""]
[null,""]
[null,""]
[null,""]
[null,""]
[null,""]
[null,""]
[null,""]
[null,""]
[null,""]
[null,""]
[null,""]
[null,""]
[null,""]
[null,""]
[null,""]
[null,""]
[null,""]
[null,""]
[null,""]
[null,""]
[null,""]
[null,""]
[null,""]
[null,""]
[null,""]
[null,""]
[null,""]
[null,""]
[null,""]
[null,""]
[null,""]
[]
[null,null,null,null,null,null,null,null,null,null,null,null,null,null,null,null,null,null,null,null,null,null,null,null,null,null,null,null,null,null,null,null,null,null,"Totais pagas",{"$f":"SUM(AJ11:AJ510)","v":0},{"$f":"SUM(AK11:AK510)","v":0},0,0,0,{"$f":"SUM(AO11:AO510)","v":0}]

{"sheet":"Guia 16","index":15,"n_rows":512,"n_cols":46,"rows_kept":512,"cut":false,"hidden":true,"merged":[[4,2,4,8],[5,4,5,7],[6,2,6,5],[6,6,6,9],[6,10,6,11],[7,19,8,19],[6,15,6,22],[6,23,6,34],[6,35,6,45],[7,2,8,2],[7,3,8,3],[7,4,8,4],[7,5,8,5],[7,6,8,6],[7,7,8,7],[7,8,8,8],[6,14,8,14],[7,9,8,9],[7,10,8,10],[7,11,8,11],[7,12,8,12],[7,13,8,13],[7,15,8,15],[7,16,8,16],[7,17,8,17],[7,18,8,18],[7,35,7,40],[7,41,7,43],[7,44,7,45],[7,20,8,20],[7,21,8,21],[7,22,8,22],[7,23,7,28],[7,29,7,31],[7,32,7,34]]}
[]
[null,null,"Superior Tribunal de Justiça"]
[null,null,"Secretaria de Processamento de Feitos"]
[null,null,"Coordenadoria de Processamento de Feitos em Execução Judicial"]
[null,null,{"$f":"\"Relação das Requisições de Pequeno Valor - RPV pagas pelo STJ em \"&IF(F11=\"\",\"\",UPPER((TEXT(F11,\"mmmm/aaaa\"))))","v":"Relação das Requisições de Pequeno Valor - RPV pagas pelo STJ em "}]
[]
[null,null,"RPV",null,null,null,"P R O C E S S O     D E     O R I G E M",null,null,null,"E N T I D A D E S",null,"R E Q U E R E N T E","A D V O G A D O","Natureza do crédito","I N D I C A D O R E S",null,null,null,null,null,null,null,"VALORES REQUISITADOS",null,null,null,null,null,null,null,null,null,null,null,"VALORES ATUALIZADOS PARA PAGAMENTO"]
[null,null,"Nº","Registro","Autuada em","data do pgto","Ação","Autuada em","Tipo de causa","Trânsito","Entidade devedora","Órgão de origem","Origem do crédito","Origem do crédito",null,"Tributário","EC 94 2016","Lei 13.463 2017","PRC/RPV de origem","Nº DA GRU","DOENÇA GRAVE","Deficiência física","Isento de IR","Beneficiários",null,null,null,null,null,"PSSS",null,null,"R R A",null,null,"Beneficiários",null,null,null,null,null,"P S S S",null,null,"R R A"]
[null,null,null,null,null,null,null,null,null,null,null,null,null,null,null,null,null,null,null,null,null,null,null,"Total","Adv I","Adv II","Adv III","Adv IV","Requerente","Base","Desc","Patronal","NMA","Exercícios anteriores","Desconto","Total","Adv I","Adv II","Adv III","Adv IV","Reqte","BASE desc","Desc","Patronal","Exercícios anteriores","Dedução"]
[]
[null,{"$f":"IF(C11=\"\",\"\",1)","v":""}]
[null,{"$f":"IF(C12=\"\",\"\",B11+1)","v":""}]
[null,{"$f":"IF(C13=\"\",\"\",B12+1)","v":""}]
[null,""]
[null,""]
[null,""]
[null,""]
[null,""]
[null,""]
[null,""]
[null,""]
[null,""]
[null,""]
[null,""]
[null,""]
[null,""]
[null,""]
[null,""]
[null,""]
[null,""]
[null,""]
[null,""]
[null,""]
[null,""]
[null,""]
[null,""]
[null,""]
[null,""]
[null,""]
[null,""]
[null,""]
[null,""]
[null,""]
[null,""]
[null,""]
[null,""]
[null,""]
[null,""]
[null,""]
[null,""]
[null,""]
[null,""]
[null,""]
[null,""]
[null,""]
[null,""]
[null,""]
[null,""]
[null,""]
[null,""]
[null,""]
[null,""]
[null,""]
[null,""]
[null,""]
[null,""]
[null,""]
[null,""]
[null,""]
[null,""]
[null,""]
[null,""]
[null,""]
[null,""]
[null,""]
[null,""]
[null,{"$f":"IF(C77=\"\",\"\",B76+1)","v":""}]
[null,""]
[null,""]
[null,""]
[null,""]
[null,""]
[null,""]
[null,""]
[null,""]
[null,""]
[null,""]
[null,""]
[null,""]
[null,""]
[null,""]
[null,""]
[null,""]
[null,""]
[null,""]
[null,""]
[null,""]
[null,""]
[null,""]
[null,""]
[null,""]
[null,""]
[null,""]
[null,""]
[null,""]
[null,""]
[null,""]
[null,""]
[null,""]
[null,""]
[null,""]
[null,""]
[null,""]
[null,""]
[null,""]
[null,""]
[null,""]
[null,""]
[null,""]
[null,""]
[null,""]
[null,""]
[null,""]
[null,""]
[null,""]
[null,""]
[null,""]
[null,""]
[null,""]
[null,""]
[null,""]
[null,""]
[null,""]
[null,""]
[null,""]
[null,""]
[null,""]
[null,""]
[null,""]
[null,""]
[null,{"$f":"IF(C141=\"\",\"\",B140+1)","v":""}]
[null,""]
[null,""]
[null,""]
[null,""]
[null,""]
[null,""]
[null,""]
[null,""]
[null,""]
[null,""]
[null,""]
[null,""]
[null,""]
[null,""]
[null,""]
[null,""]
[null,""]
[null,""]
[null,""]
[null,""]
[null,""]
[null,""]
[null,""]
[null,""]
[null,""]
[null,""]
[null,""]
[null,""]
[null,""]
[null,""]
[null,""]
[null,""]
[null,""]
[null,""]
[null,""]
[null,""]
[null,""]
[null,""]
[null,""]
[null,""]
[null,""]
[null,""]
[null,""]
[null,""]
[null,""]
[null,""]
[null,""]
[null,""]
[null,""]
[null,""]
[null,""]
[null,""]
[null,""]
[null,""]
[null,""]
[null,""]
[null,""]
[null,""]
[null,""]
[null,""]
[null,""]
[null,""]
[null,""]
[null,{"$f":"IF(C205=\"\",\"\",B204+1)","v":""}]
[null,""]
[null,""]
[null,""]
[null,""]
[null,""]
[null,""]
[null,""]
[null,""]
[null,""]
[null,""]
[null,""]
[null,""]
[null,""]
[null,""]
[null,""]
[null,""]
[null,""]
[null,""]
[null,""]
[null,""]
[null,""]
[null,""]
[null,""]
[null,""]
[null,""]
[null,""]
[null,""]
[null,""]
[null,""]
[null,""]
[null,""]
[null,""]
[null,""]
[null,""]
[null,""]
[null,""]
[null,""]
[null,""]
[null,""]
[null,""]
[null,""]
[null,""]
[null,""]
[null,""]
[null,""]
[null,""]
[null,""]
[null,""]
[null,""]
[null,""]
[null,""]
[null,""]
[null,""]
[null,""]
[null,""]
[null,""]
[null,""]
[null,""]
[null,""]
[null,""]
[null,""]
[null,""]
[null,""]
[null,{"$f":"IF(C269=\"\",\"\",B268+1)","v":""}]
[null,""]
[null,""]
[null,""]
[null,""]
[null,""]
[null,""]
[null,""]
[null,""]
[null,""]
[null,""]
[null,""]
[null,""]
[null,""]
[null,""]
[null,""]
[null,""]
[null,""]
[null,""]
[null,""]
[null,""]
[null,""]
[null,""]
[null,""]
[null,""]
[null,""]
[null,""]
[null,""]
[null,""]
[null,""]
[null,""]
[null,""]
[null,""]
[null,""]
[null,""]
[null,""]
[null,""]
[null,""]
[null,""]
[null,""]
[null,""]
[null,""]
[null,""]
[null,""]
[null,""]
[null,""]
[null,""]
[null,""]
[null,""]
[null,""]
[null,""]
[null,""]
[null,""]
[null,""]
[null,""]
[null,""]
[null,""]
[null,""]
[null,""]
[null,""]
[null,""]
[null,""]
[null,""]
[null,""]
[null,{"$f":"IF(C333=\"\",\"\",B332+1)","v":""}]
[null,""]
[null,""]
[null,""]
[null,""]
[null,""]
[null,""]
[null,""]
[null,""]
[null,""]
[null,""]
[null,""]
[null,""]
[null,""]
[null,""]
[null,""]
[null,""]
[null,""]
[null,""]
[null,""]
[null,""]
[null,""]
[null,""]
[null,""]
[null,""]
[null,""]
[null,""]
[null,""]
[null,""]
[null,""]
[null,""]
[null,""]
[null,""]
[null,""]
[null,""]
[null,""]
[null,""]
[null,""]
[null,""]
[null,""]
[null,""]
[null,""]
[null,""]
[null,""]
[null,""]
[null,""]
[null,""]
[null,""]
[null,""]
[null,""]
[null,""]
[null,""]
[null,""]
[null,""]
[null,""]
[null,""]
[null,""]
[null,""]
[null,""]
[null,""]
[null,""]
[null,""]
[null,""]
[null,""]
[null,{"$f":"IF(C397=\"\",\"\",B396+1)","v":""}]
[null,""]
[null,""]
[null,""]
[null,""]
[null,""]
[null,""]
[null,""]
[null,""]
[null,""]
[null,""]
[null,""]
[null,""]
[null,""]
[null,""]
[null,""]
[null,""]
[null,""]
[null,""]
[null,""]
[null,""]
[null,""]
[null,""]
[null,""]
[null,""]
[null,""]
[null,""]
[null,""]
[null,""]
[null,""]
[null,""]
[null,""]
[null,""]
[null,""]
[null,""]
[null,""]
[null,""]
[null,""]
[null,""]
[null,""]
[null,""]
[null,""]
[null,""]
[null,""]
[null,""]
[null,""]
[null,""]
[null,""]
[null,""]
[null,""]
[null,""]
[null,""]
[null,""]
[null,""]
[null,""]
[null,""]
[null,""]
[null,""]
[null,""]
[null,""]
[null,""]
[null,""]
[null,""]
[null,""]
[null,{"$f":"IF(C461=\"\",\"\",B460+1)","v":""}]
[null,""]
[null,""]
[null,""]
[null,""]
[null,""]
[null,""]
[null,""]
[null,""]
[null,""]
[null,""]
[null,""]
[null,""]
[null,""]
[null,""]
[null,""]
[null,""]
[null,""]
[null,""]
[null,""]
[null,""]
[null,""]
[null,""]
[null,""]
[null,""]
[null,""]
[null,""]
[null,""]
[null,""]
[null,""]
[null,""]
[null,""]
[null,""]
[null,""]
[null,""]
[null,""]
[null,""]
[null,""]
[null,""]
[null,""]
[null,""]
[null,""]
[null,""]
[null,""]
[null,""]
[null,""]
[null,""]
[null,""]
[null,""]
[null,""]
[]
[null,null,null,null,null,null,null,null,null,null,null,null,null,null,null,null,null,null,null,null,null,null,null,null,null,null,null,null,null,null,null,null,null,null,"Totais pagas",{"$f":"SUM(AJ11:AJ510)","v":0},{"$f":"SUM(AK11:AK510)","v":0},0,0,0,{"$f":"SUM(AO11:AO510)","v":0}]

{"sheet":"Guia 17","index":16,"n_rows":512,"n_cols":46,"rows_kept":512,"cut":false,"hidden":true,"merged":[[4,2,4,8],[5,4,5,7],[6,2,6,5],[6,6,6,9],[6,10,6,11],[7,19,8,19],[6,15,6,22],[6,23,6,34],[6,35,6,45],[7,2,8,2],[7,3,8,3],[7,4,8,4],[7,5,8,5],[7,6,8,6],[7,7,8,7],[7,8,8,8],[6,14,8,14],[7,9,8,9],[7,10,8,10],[7,11,8,11],[7,12,8,12],[7,13,8,13],[7,15,8,15],[7,16,8,16],[7,17,8,17],[7,18,8,18],[7,35,7,40],[7,41,7,43],[7,44,7,45],[7,20,8,20],[7,21,8,21],[7,22,8,22],[7,23,7,28],[7,29,7,31],[7,32,7,34]]}
[]
[null,null,"Superior Tribunal de Justiça"]
[null,null,"Secretaria de Processamento de Feitos"]
[null,null,"Coordenadoria de Processamento de Feitos em Execução Judicial"]
[null,null,{"$f":"\"Relação das Requisições de Pequeno Valor - RPV pagas pelo STJ em \"&IF(F11=\"\",\"\",UPPER((TEXT(F11,\"mmmm/aaaa\"))))","v":"Relação das Requisições de Pequeno Valor - RPV pagas pelo STJ em "}]
[]
[null,null,"RPV",null,null,null,"P R O C E S S O     D E     O R I G E M",null,null,null,"E N T I D A D E S",null,"R E Q U E R E N T E","A D V O G A D O","Natureza do crédito","I N D I C A D O R E S",null,null,null,null,null,null,null,"VALORES REQUISITADOS",null,null,null,null,null,null,null,null,null,null,null,"VALORES ATUALIZADOS PARA PAGAMENTO"]
[null,null,"Nº","Registro","Autuada em","data do pgto","Ação","Autuada em","Tipo de causa","Trânsito","Entidade devedora","Órgão de origem","Origem do crédito","Origem do crédito",null,"Tributário","EC 94 2016","Lei 13.463 2017","PRC/RPV de origem","Nº DA GRU","DOENÇA GRAVE","Deficiência física","Isento de IR","Beneficiários",null,null,null,null,null,"PSSS",null,null,"R R A",null,null,"Beneficiários",null,null,null,null,null,"P S S S",null,null,"R R A"]
[null,null,null,null,null,null,null,null,null,null,null,null,null,null,null,null,null,null,null,null,null,null,null,"Total","Adv I","Adv II","Adv III","Adv IV","Requerente","Base","Desc","Patronal","NMA","Exercícios anteriores","Desconto","Total","Adv I","Adv II","Adv III","Adv IV","Reqte","BASE desc","Desc","Patronal","Exercícios anteriores","Dedução"]
[]
[null,{"$f":"IF(C11=\"\",\"\",1)","v":""}]
[null,{"$f":"IF(C12=\"\",\"\",B11+1)","v":""}]
[null,{"$f":"IF(C13=\"\",\"\",B12+1)","v":""}]
[null,""]
[null,""]
[null,""]
[null,""]
[null,""]
[null,""]
[null,""]
[null,""]
[null,""]
[null,""]
[null,""]
[null,""]
[null,""]
[null,""]
[null,""]
[null,""]
[null,""]
[null,""]
[null,""]
[null,""]
[null,""]
[null,""]
[null,""]
[null,""]
[null,""]
[null,""]
[null,""]
[null,""]
[null,""]
[null,""]
[null,""]
[null,""]
[null,""]
[null,""]
[null,""]
[null,""]
[null,""]
[null,""]
[null,""]
[null,""]
[null,""]
[null,""]
[null,""]
[null,""]
[null,""]
[null,""]
[null,""]
[null,""]
[null,""]
[null,""]
[null,""]
[null,""]
[null,""]
[null,""]
[null,""]
[null,""]
[null,""]
[null,""]
[null,""]
[null,""]
[null,""]
[null,""]
[null,""]
[null,{"$f":"IF(C77=\"\",\"\",B76+1)","v":""}]
[null,""]
[null,""]
[null,""]
[null,""]
[null,""]
[null,""]
[null,""]
[null,""]
[null,""]
[null,""]
[null,""]
[null,""]
[null,""]
[null,""]
[null,""]
[null,""]
[null,""]
[null,""]
[null,""]
[null,""]
[null,""]
[null,""]
[null,""]
[null,""]
[null,""]
[null,""]
[null,""]
[null,""]
[null,""]
[null,""]
[null,""]
[null,""]
[null,""]
[null,""]
[null,""]
[null,""]
[null,""]
[null,""]
[null,""]
[null,""]
[null,""]
[null,""]
[null,""]
[null,""]
[null,""]
[null,""]
[null,""]
[null,""]
[null,""]
[null,""]
[null,""]
[null,""]
[null,""]
[null,""]
[null,""]
[null,""]
[null,""]
[null,""]
[null,""]
[null,""]
[null,""]
[null,""]
[null,""]
[null,{"$f":"IF(C141=\"\",\"\",B140+1)","v":""}]
[null,""]
[null,""]
[null,""]
[null,""]
[null,""]
[null,""]
[null,""]
[null,""]
[null,""]
[null,""]
[null,""]
[null,""]
[null,""]
[null,""]
[null,""]
[null,""]
[null,""]
[null,""]
[null,""]
[null,""]
[null,""]
[null,""]
[null,""]
[null,""]
[null,""]
[null,""]
[null,""]
[null,""]
[null,""]
[null,""]
[null,""]
[null,""]
[null,""]
[null,""]
[null,""]
[null,""]
[null,""]
[null,""]
[null,""]
[null,""]
[null,""]
[null,""]
[null,""]
[null,""]
[null,""]
[null,""]
[null,""]
[null,""]
[null,""]
[null,""]
[null,""]
[null,""]
[null,""]
[null,""]
[null,""]
[null,""]
[null,""]
[null,""]
[null,""]
[null,""]
[null,""]
[null,""]
[null,""]
[null,{"$f":"IF(C205=\"\",\"\",B204+1)","v":""}]
[null,""]
[null,""]
[null,""]
[null,""]
[null,""]
[null,""]
[null,""]
[null,""]
[null,""]
[null,""]
[null,""]
[null,""]
[null,""]
[null,""]
[null,""]
[null,""]
[null,""]
[null,""]
[null,""]
[null,""]
[null,""]
[null,""]
[null,""]
[null,""]
[null,""]
[null,""]
[null,""]
[null,""]
[null,""]
[null,""]
[null,""]
[null,""]
[null,""]
[null,""]
[null,""]
[null,""]
[null,""]
[null,""]
[null,""]
[null,""]
[null,""]
[null,""]
[null,""]
[null,""]
[null,""]
[null,""]
[null,""]
[null,""]
[null,""]
[null,""]
[null,""]
[null,""]
[null,""]
[null,""]
[null,""]
[null,""]
[null,""]
[null,""]
[null,""]
[null,""]
[null,""]
[null,""]
[null,""]
[null,{"$f":"IF(C269=\"\",\"\",B268+1)","v":""}]
[null,""]
[null,""]
[null,""]
[null,""]
[null,""]
[null,""]
[null,""]
[null,""]
[null,""]
[null,""]
[null,""]
[null,""]
[null,""]
[null,""]
[null,""]
[null,""]
[null,""]
[null,""]
[null,""]
[null,""]
[null,""]
[null,""]
[null,""]
[null,""]
[null,""]
[null,""]
[null,""]
[null,""]
[null,""]
[null,""]
[null,""]
[null,""]
[null,""]
[null,""]
[null,""]
[null,""]
[null,""]
[null,""]
[null,""]
[null,""]
[null,""]
[null,""]
[null,""]
[null,""]
[null,""]
[null,""]
[null,""]
[null,""]
[null,""]
[null,""]
[null,""]
[null,""]
[null,""]
[null,""]
[null,""]
[null,""]
[null,""]
[null,""]
[null,""]
[null,""]
[null,""]
[null,""]
[null,""]
[null,{"$f":"IF(C333=\"\",\"\",B332+1)","v":""}]
[null,""]
[null,""]
[null,""]
[null,""]
[null,""]
[null,""]
[null,""]
[null,""]
[null,""]
[null,""]
[null,""]
[null,""]
[null,""]
[null,""]
[null,""]
[null,""]
[null,""]
[null,""]
[null,""]
[null,""]
[null,""]
[null,""]
[null,""]
[null,""]
[null,""]
[null,""]
[null,""]
[null,""]
[null,""]
[null,""]
[null,""]
[null,""]
[null,""]
[null,""]
[null,""]
[null,""]
[null,""]
[null,""]
[null,""]
[null,""]
[null,""]
[null,""]
[null,""]
[null,""]
[null,""]
[null,""]
[null,""]
[null,""]
[null,""]
[null,""]
[null,""]
[null,""]
[null,""]
[null,""]
[null,""]
[null,""]
[null,""]
[null,""]
[null,""]
[null,""]
[null,""]
[null,""]
[null,""]
[null,{"$f":"IF(C397=\"\",\"\",B396+1)","v":""}]
[null,""]
[null,""]
[null,""]
[null,""]
[null,""]
[null,""]
[null,""]
[null,""]
[null,""]
[null,""]
[null,""]
[null,""]
[null,""]
[null,""]
[null,""]
[null,""]
[null,""]
[null,""]
[null,""]
[null,""]
[null,""]
[null,""]
[null,""]
[null,""]
[null,""]
[null,""]
[null,""]
[null,""]
[null,""]
[null,""]
[null,""]
[null,""]
[null,""]
[null,""]
[null,""]
[null,""]
[null,""]
[null,""]
[null,""]
[null,""]
[null,""]
[null,""]
[null,""]
[null,""]
[null,""]
[null,""]
[null,""]
[null,""]
[null,""]
[null,""]
[null,""]
[null,""]
[null,""]
[null,""]
[null,""]
[null,""]
[null,""]
[null,""]
[null,""]
[null,""]
[null,""]
[null,""]
[null,""]
[null,{"$f":"IF(C461=\"\",\"\",B460+1)","v":""}]
[null,""]
[null,""]
[null,""]
[null,""]
[null,""]
[null,""]
[null,""]
[null,""]
[null,""]
[null,""]
[null,""]
[null,""]
[null,""]
[null,""]
[null,""]
[null,""]
[null,""]
[null,""]
[null,""]
[null,""]
[null,""]
[null,""]
[null,""]
[null,""]
[null,""]
[null,""]
[null,""]
[null,""]
[null,""]
[null,""]
[null,""]
[null,""]
[null,""]
[null,""]
[null,""]
[null,""]
[null,""]
[null,""]
[null,""]
[null,""]
[null,""]
[null,""]
[null,""]
[null,""]
[null,""]
[null,""]
[null,""]
[null,""]
[null,""]
[]
[null,null,null,null,null,null,null,null,null,null,null,null,null,null,null,null,null,null,null,null,null,null,null,null,null,null,null,null,null,null,null,null,null,null,"Totais pagas",{"$f":"SUM(AJ11:AJ510)","v":0},{"$f":"SUM(AK11:AK510)","v":0},0,0,0,{"$f":"SUM(AO11:AO510)","v":0}]

{"sheet":"Guia 18","index":17,"n_rows":512,"n_cols":46,"rows_kept":512,"cut":false,"hidden":true,"merged":[[4,2,4,8],[5,4,5,7],[6,2,6,5],[6,6,6,9],[6,10,6,11],[7,19,8,19],[6,15,6,22],[6,23,6,34],[6,35,6,45],[7,2,8,2],[7,3,8,3],[7,4,8,4],[7,5,8,5],[7,6,8,6],[7,7,8,7],[7,8,8,8],[6,14,8,14],[7,9,8,9],[7,10,8,10],[7,11,8,11],[7,12,8,12],[7,13,8,13],[7,15,8,15],[7,16,8,16],[7,17,8,17],[7,18,8,18],[7,35,7,40],[7,41,7,43],[7,44,7,45],[7,20,8,20],[7,21,8,21],[7,22,8,22],[7,23,7,28],[7,29,7,31],[7,32,7,34]]}
[]
[null,null,"Superior Tribunal de Justiça"]
[null,null,"Secretaria de Processamento de Feitos"]
[null,null,"Coordenadoria de Processamento de Feitos em Execução Judicial"]
[null,null,{"$f":"\"Relação das Requisições de Pequeno Valor - RPV pagas pelo STJ em \"&IF(F11=\"\",\"\",UPPER((TEXT(F11,\"mmmm/aaaa\"))))","v":"Relação das Requisições de Pequeno Valor - RPV pagas pelo STJ em "}]
[]
[null,null,"RPV",null,null,null,"P R O C E S S O     D E     O R I G E M",null,null,null,"E N T I D A D E S",null,"R E Q U E R E N T E","A D V O G A D O","Natureza do crédito","I N D I C A D O R E S",null,null,null,null,null,null,null,"VALORES REQUISITADOS",null,null,null,null,null,null,null,null,null,null,null,"VALORES ATUALIZADOS PARA PAGAMENTO"]
[null,null,"Nº","Registro","Autuada em","data do pgto","Ação","Autuada em","Tipo de causa","Trânsito","Entidade devedora","Órgão de origem","Origem do crédito","Origem do crédito",null,"Tributário","EC 94 2016","Lei 13.463 2017","PRC/RPV de origem","Nº DA GRU","DOENÇA GRAVE","Deficiência física","Isento de IR","Beneficiários",null,null,null,null,null,"PSSS",null,null,"R R A",null,null,"Beneficiários",null,null,null,null,null,"P S S S",null,null,"R R A"]
[null,null,null,null,null,null,null,null,null,null,null,null,null,null,null,null,null,null,null,null,null,null,null,"Total","Adv I","Adv II","Adv III","Adv IV","Requerente","Base","Desc","Patronal","NMA","Exercícios anteriores","Desconto","Total","Adv I","Adv II","Adv III","Adv IV","Reqte","BASE desc","Desc","Patronal","Exercícios anteriores","Dedução"]
[]
[null,{"$f":"IF(C11=\"\",\"\",1)","v":""}]
[null,{"$f":"IF(C12=\"\",\"\",B11+1)","v":""}]
[null,{"$f":"IF(C13=\"\",\"\",B12+1)","v":""}]
[null,""]
[null,""]
[null,""]
[null,""]
[null,""]
[null,""]
[null,""]
[null,""]
[null,""]
[null,""]
[null,""]
[null,""]
[null,""]
[null,""]
[null,""]
[null,""]
[null,""]
[null,""]
[null,""]
[null,""]
[null,""]
[null,""]
[null,""]
[null,""]
[null,""]
[null,""]
[null,""]
[null,""]
[null,""]
[null,""]
[null,""]
[null,""]
[null,""]
[null,""]
[null,""]
[null,""]
[null,""]
[null,""]
[null,""]
[null,""]
[null,""]
[null,""]
[null,""]
[null,""]
[null,""]
[null,""]
[null,""]
[null,""]
[null,""]
[null,""]
[null,""]
[null,""]
[null,""]
[null,""]
[null,""]
[null,""]
[null,""]
[null,""]
[null,""]
[null,""]
[null,""]
[null,""]
[null,""]
[null,{"$f":"IF(C77=\"\",\"\",B76+1)","v":""}]
[null,""]
[null,""]
[null,""]
[null,""]
[null,""]
[null,""]
[null,""]
[null,""]
[null,""]
[null,""]
[null,""]
[null,""]
[null,""]
[null,""]
[null,""]
[null,""]
[null,""]
[null,""]
[null,""]
[null,""]
[null,""]
[null,""]
[null,""]
[null,""]
[null,""]
[null,""]
[null,""]
[null,""]
[null,""]
[null,""]
[null,""]
[null,""]
[null,""]
[null,""]
[null,""]
[null,""]
[null,""]
[null,""]
[null,""]
[null,""]
[null,""]
[null,""]
[null,""]
[null,""]
[null,""]
[null,""]
[null,""]
[null,""]
[null,""]
[null,""]
[null,""]
[null,""]
[null,""]
[null,""]
[null,""]
[null,""]
[null,""]
[null,""]
[null,""]
[null,""]
[null,""]
[null,""]
[null,""]
[null,{"$f":"IF(C141=\"\",\"\",B140+1)","v":""}]
[null,""]
[null,""]
[null,""]
[null,""]
[null,""]
[null,""]
[null,""]
[null,""]
[null,""]
[null,""]
[null,""]
[null,""]
[null,""]
[null,""]
[null,""]
[null,""]
[null,""]
[null,""]
[null,""]
[null,""]
[null,""]
[null,""]
[null,""]
[null,""]
[null,""]
[null,""]
[null,""]
[null,""]
[null,""]
[null,""]
[null,""]
[null,""]
[null,""]
[null,""]
[null,""]
[null,""]
[null,""]
[null,""]
[null,""]
[null,""]
[null,""]
[null,""]
[null,""]
[null,""]
[null,""]
[null,""]
[null,""]
[null,""]
[null,""]
[null,""]
[null,""]
[null,""]
[null,""]
[null,""]
[null,""]
[null,""]
[null,""]
[null,""]
[null,""]
[null,""]
[null,""]
[null,""]
[null,""]
[null,{"$f":"IF(C205=\"\",\"\",B204+1)","v":""}]
[null,""]
[null,""]
[null,""]
[null,""]
[null,""]
[null,""]
[null,""]
[null,""]
[null,""]
[null,""]
[null,""]
[null,""]
[null,""]
[null,""]
[null,""]
[null,""]
[null,""]
[null,""]
[null,""]
[null,""]
[null,""]
[null,""]
[null,""]
[null,""]
[null,""]
[null,""]
[null,""]
[null,""]
[null,""]
[null,""]
[null,""]
[null,""]
[null,""]
[null,""]
[null,""]
[null,""]
[null,""]
[null,""]
[null,""]
[null,""]
[null,""]
[null,""]
[null,""]
[null,""]
[null,""]
[null,""]
[null,""]
[null,""]
[null,""]
[null,""]
[null,""]
[null,""]
[null,""]
[null,""]
[null,""]
[null,""]
[null,""]
[null,""]
[null,""]
[null,""]
[null,""]
[null,""]
[null,""]
[null,{"$f":"IF(C269=\"\",\"\",B268+1)","v":""}]
[null,""]
[null,""]
[null,""]
[null,""]
[null,""]
[null,""]
[null,""]
[null,""]
[null,""]
[null,""]
[null,""]
[null,""]
[null,""]
[null,""]
[null,""]
[null,""]
[null,""]
[null,""]
[null,""]
[null,""]
[null,""]
[null,""]
[null,""]
[null,""]
[null,""]
[null,""]
[null,""]
[null,""]
[null,""]
[null,""]
[null,""]
[null,""]
[null,""]
[null,""]
[null,""]
[null,""]
[null,""]
[null,""]
[null,""]
[null,""]
[null,""]
[null,""]
[null,""]
[null,""]
[null,""]
[null,""]
[null,""]
[null,""]
[null,""]
[null,""]
[null,""]
[null,""]
[null,""]
[null,""]
[null,""]
[null,""]
[null,""]
[null,""]
[null,""]
[null,""]
[null,""]
[null,""]
[null,""]
[null,{"$f":"IF(C333=\"\",\"\",B332+1)","v":""}]
[null,""]
[null,""]
[null,""]
[null,""]
[null,""]
[null,""]
[null,""]
[null,""]
[null,""]
[null,""]
[null,""]
[null,""]
[null,""]
[null,""]
[null,""]
[null,""]
[null,""]
[null,""]
[null,""]
[null,""]
[null,""]
[null,""]
[null,""]
[null,""]
[null,""]
[null,""]
[null,""]
[null,""]
[null,""]
[null,""]
[null,""]
[null,""]
[null,""]
[null,""]
[null,""]
[null,""]
[null,""]
[null,""]
[null,""]
[null,""]
[null,""]
[null,""]
[null,""]
[null,""]
[null,""]
[null,""]
[null,""]
[null,""]
[null,""]
[null,""]
[null,""]
[null,""]
[null,""]
[null,""]
[null,""]
[null,""]
[null,""]
[null,""]
[null,""]
[null,""]
[null,""]
[null,""]
[null,""]
[null,{"$f":"IF(C397=\"\",\"\",B396+1)","v":""}]
[null,""]
[null,""]
[null,""]
[null,""]
[null,""]
[null,""]
[null,""]
[null,""]
[null,""]
[null,""]
[null,""]
[null,""]
[null,""]
[null,""]
[null,""]
[null,""]
[null,""]
[null,""]
[null,""]
[null,""]
[null,""]
[null,""]
[null,""]
[null,""]
[null,""]
[null,""]
[null,""]
[null,""]
[null,""]
[null,""]
[null,""]
[null,""]
[null,""]
[null,""]
[null,""]
[null,""]
[null,""]
[null,""]
[null,""]
[null,""]
[null,""]
[null,""]
[null,""]
[null,""]
[null,""]
[null,""]
[null,""]
[null,""]
[null,""]
[null,""]
[null,""]
[null,""]
[null,""]
[null,""]
[null,""]
[null,""]
[null,""]
[null,""]
[null,""]
[null,""]
[null,""]
[null,""]
[null,""]
[null,{"$f":"IF(C461=\"\",\"\",B460+1)","v":""}]
[null,""]
[null,""]
[null,""]
[null,""]
[null,""]
[null,""]
[null,""]
[null,""]
[null,""]
[null,""]
[null,""]
[null,""]
[null,""]
[null,""]
[null,""]
[null,""]
[null,""]
[null,""]
[null,""]
[null,""]
[null,""]
[null,""]
[null,""]
[null,""]
[null,""]
[null,""]
[null,""]
[null,""]
[null,""]
[null,""]
[null,""]
[null,""]
[null,""]
[null,""]
[null,""]
[null,""]
[null,""]
[null,""]
[null,""]
[null,""]
[null,""]
[null,""]
[null,""]
[null,""]
[null,""]
[null,""]
[null,""]
[null,""]
[null,""]
[]
[null,null,null,null,null,null,null,null,null,null,null,null,null,null,null,null,null,null,null,null,null,null,null,null,null,null,null,null,null,null,null,null,null,null,"Totais pagas",{"$f":"SUM(AJ11:AJ510)","v":0},{"$f":"SUM(AK11:AK510)","v":0},0,0,0,{"$f":"SUM(AO11:AO510)","v":0}]

{"sheet":"Guia 19","index":18,"n_rows":512,"n_cols":46,"rows_kept":512,"cut":false,"hidden":true,"merged":[[4,2,4,8],[5,4,5,7],[6,2,6,5],[6,6,6,9],[6,10,6,11],[7,19,8,19],[6,15,6,22],[6,23,6,34],[6,35,6,45],[7,2,8,2],[7,3,8,3],[7,4,8,4],[7,5,8,5],[7,6,8,6],[7,7,8,7],[7,8,8,8],[6,14,8,14],[7,9,8,9],[7,10,8,10],[7,11,8,11],[7,12,8,12],[7,13,8,13],[7,15,8,15],[7,16,8,16],[7,17,8,17],[7,18,8,18],[7,35,7,40],[7,41,7,43],[7,44,7,45],[7,20,8,20],[7,21,8,21],[7,22,8,22],[7,23,7,28],[7,29,7,31],[7,32,7,34]]}
[]
[null,null,"Superior Tribunal de Justiça"]
[null,null,"Secretaria de Processamento de Feitos"]
[null,null,"Coordenadoria de Processamento de Feitos em Execução Judicial"]
[null,null,{"$f":"\"Relação das Requisições de Pequeno Valor - RPV pagas pelo STJ em \"&IF(F11=\"\",\"\",UPPER((TEXT(F11,\"mmmm/aaaa\"))))","v":"Relação das Requisições de Pequeno Valor - RPV pagas pelo STJ em "}]
[]
[null,null,"RPV",null,null,null,"P R O C E S S O     D E     O R I G E M",null,null,null,"E N T I D A D E S",null,"R E Q U E R E N T E","A D V O G A D O","Natureza do crédito","I N D I C A D O R E S",null,null,null,null,null,null,null,"VALORES REQUISITADOS",null,null,null,null,null,null,null,null,null,null,null,"VALORES ATUALIZADOS PARA PAGAMENTO"]
[null,null,"Nº","Registro","Autuada em","data do pgto","Ação","Autuada em","Tipo de causa","Trânsito","Entidade devedora","Órgão de origem","Origem do crédito","Origem do crédito",null,"Tributário","EC 94 2016","Lei 13.463 2017","PRC/RPV de origem","Nº DA GRU","DOENÇA GRAVE","Deficiência física","Isento de IR","Beneficiários",null,null,null,null,null,"PSSS",null,null,"R R A",null,null,"Beneficiários",null,null,null,null,null,"P S S S",null,null,"R R A"]
[null,null,null,null,null,null,null,null,null,null,null,null,null,null,null,null,null,null,null,null,null,null,null,"Total","Adv I","Adv II","Adv III","Adv IV","Requerente","Base","Desc","Patronal","NMA","Exercícios anteriores","Desconto","Total","Adv I","Adv II","Adv III","Adv IV","Reqte","BASE desc","Desc","Patronal","Exercícios anteriores","Dedução"]
[]
[null,{"$f":"IF(C11=\"\",\"\",1)","v":""}]
[null,{"$f":"IF(C12=\"\",\"\",B11+1)","v":""}]
[null,{"$f":"IF(C13=\"\",\"\",B12+1)","v":""}]
[null,""]
[null,""]
[null,""]
[null,""]
[null,""]
[null,""]
[null,""]
[null,""]
[null,""]
[null,""]
[null,""]
[null,""]
[null,""]
[null,""]
[null,""]
[null,""]
[null,""]
[null,""]
[null,""]
[null,""]
[null,""]
[null,""]
[null,""]
[null,""]
[null,""]
[null,""]
[null,""]
[null,""]
[null,""]
[null,""]
[null,""]
[null,""]
[null,""]
[null,""]
[null,""]
[null,""]
[null,""]
[null,""]
[null,""]
[null,""]
[null,""]
[null,""]
[null,""]
[null,""]
[null,""]
[null,""]
[null,""]
[null,""]
[null,""]
[null,""]
[null,""]
[null,""]
[null,""]
[null,""]
[null,""]
[null,""]
[null,""]
[null,""]
[null,""]
[null,""]
[null,""]
[null,""]
[null,""]
[null,{"$f":"IF(C77=\"\",\"\",B76+1)","v":""}]
[null,""]
[null,""]
[null,""]
[null,""]
[null,""]
[null,""]
[null,""]
[null,""]
[null,""]
[null,""]
[null,""]
[null,""]
[null,""]
[null,""]
[null,""]
[null,""]
[null,""]
[null,""]
[null,""]
[null,""]
[null,""]
[null,""]
[null,""]
[null,""]
[null,""]
[null,""]
[null,""]
[null,""]
[null,""]
[null,""]
[null,""]
[null,""]
[null,""]
[null,""]
[null,""]
[null,""]
[null,""]
[null,""]
[null,""]
[null,""]
[null,""]
[null,""]
[null,""]
[null,""]
[null,""]
[null,""]
[null,""]
[null,""]
[null,""]
[null,""]
[null,""]
[null,""]
[null,""]
[null,""]
[null,""]
[null,""]
[null,""]
[null,""]
[null,""]
[null,""]
[null,""]
[null,""]
[null,""]
[null,{"$f":"IF(C141=\"\",\"\",B140+1)","v":""}]
[null,""]
[null,""]
[null,""]
[null,""]
[null,""]
[null,""]
[null,""]
[null,""]
[null,""]
[null,""]
[null,""]
[null,""]
[null,""]
[null,""]
[null,""]
[null,""]
[null,""]
[null,""]
[null,""]
[null,""]
[null,""]
[null,""]
[null,""]
[null,""]
[null,""]
[null,""]
[null,""]
[null,""]
[null,""]
[null,""]
[null,""]
[null,""]
[null,""]
[null,""]
[null,""]
[null,""]
[null,""]
[null,""]
[null,""]
[null,""]
[null,""]
[null,""]
[null,""]
[null,""]
[null,""]
[null,""]
[null,""]
[null,""]
[null,""]
[null,""]
[null,""]
[null,""]
[null,""]
[null,""]
[null,""]
[null,""]
[null,""]
[null,""]
[null,""]
[null,""]
[null,""]
[null,""]
[null,""]
[null,{"$f":"IF(C205=\"\",\"\",B204+1)","v":""}]
[null,""]
[null,""]
[null,""]
[null,""]
[null,""]
[null,""]
[null,""]
[null,""]
[null,""]
[null,""]
[null,""]
[null,""]
[null,""]
[null,""]
[null,""]
[null,""]
[null,""]
[null,""]
[null,""]
[null,""]
[null,""]
[null,""]
[null,""]
[null,""]
[null,""]
[null,""]
[null,""]
[null,""]
[null,""]
[null,""]
[null,""]
[null,""]
[null,""]
[null,""]
[null,""]
[null,""]
[null,""]
[null,""]
[null,""]
[null,""]
[null,""]
[null,""]
[null,""]
[null,""]
[null,""]
[null,""]
[null,""]
[null,""]
[null,""]
[null,""]
[null,""]
[null,""]
[null,""]
[null,""]
[null,""]
[null,""]
[null,""]
[null,""]
[null,""]
[null,""]
[null,""]
[null,""]
[null,""]
[null,{"$f":"IF(C269=\"\",\"\",B268+1)","v":""}]
[null,""]
[null,""]
[null,""]
[null,""]
[null,""]
[null,""]
[null,""]
[null,""]
[null,""]
[null,""]
[null,""]
[null,""]
[null,""]
[null,""]
[null,""]
[null,""]
[null,""]
[null,""]
[null,""]
[null,""]
[null,""]
[null,""]
[null,""]
[null,""]
[null,""]
[null,""]
[null,""]
[null,""]
[null,""]
[null,""]
[null,""]
[null,""]
[null,""]
[null,""]
[null,""]
[null,""]
[null,""]
[null,""]
[null,""]
[null,""]
[null,""]
[null,""]
[null,""]
[null,""]
[null,""]
[null,""]
[null,""]
[null,""]
[null,""]
[null,""]
[null,""]
[null,""]
[null,""]
[null,""]
[null,""]
[null,""]
[null,""]
[null,""]
[null,""]
[null,""]
[null,""]
[null,""]
[null,""]
[null,{"$f":"IF(C333=\"\",\"\",B332+1)","v":""}]
[null,""]
[null,""]
[null,""]
[null,""]
[null,""]
[null,""]
[null,""]
[null,""]
[null,""]
[null,""]
[null,""]
[null,""]
[null,""]
[null,""]
[null,""]
[null,""]
[null,""]
[null,""]
[null,""]
[null,""]
[null,""]
[null,""]
[null,""]
[null,""]
[null,""]
[null,""]
[null,""]
[null,""]
[null,""]
[null,""]
[null,""]
[null,""]
[null,""]
[null,""]
[null,""]
[null,""]
[null,""]
[null,""]
[null,""]
[null,""]
[null,""]
[null,""]
[null,""]
[null,""]
[null,""]
[null,""]
[null,""]
[null,""]
[null,""]
[null,""]
[null,""]
[null,""]
[null,""]
[null,""]
[null,""]
[null,""]
[null,""]
[null,""]
[null,""]
[null,""]
[null,""]
[null,""]
[null,""]
[null,{"$f":"IF(C397=\"\",\"\",B396+1)","v":""}]
[null,""]
[null,""]
[null,""]
[null,""]
[null,""]
[null,""]
[null,""]
[null,""]
[null,""]
[null,""]
[null,""]
[null,""]
[null,""]
[null,""]
[null,""]
[null,""]
[null,""]
[null,""]
[null,""]
[null,""]
[null,""]
[null,""]
[null,""]
[null,""]
[null,""]
[null,""]
[null,""]
[null,""]
[null,""]
[null,""]
[null,""]
[null,""]
[null,""]
[null,""]
[null,""]
[null,""]
[null,""]
[null,""]
[null,""]
[null,""]
[null,""]
[null,""]
[null,""]
[null,""]
[null,""]
[null,""]
[null,""]
[null,""]
[null,""]
[null,""]
[null,""]
[null,""]
[null,""]
[null,""]
[null,""]
[null,""]
[null,""]
[null,""]
[null,""]
[null,""]
[null,""]
[null,""]
[null,""]
[null,{"$f":"IF(C461=\"\",\"\",B460+1)","v":""}]
[null,""]
[null,""]
[null,""]
[null,""]
[null,""]
[null,""]
[null,""]
[null,""]
[null,""]
[null,""]
[null,""]
[null,""]
[null,""]
[null,""]
[null,""]
[null,""]
[null,""]
[null,""]
[null,""]
[null,""]
[null,""]
[null,""]
[null,""]
[null,""]
[null,""]
[null,""]
[null,""]
[null,""]
[null,""]
[null,""]
[null,""]
[null,""]
[null,""]
[null,""]
[null,""]
[null,""]
[null,""]
[null,""]
[null,""]
[null,""]
[null,""]
[null,""]
[null,""]
[null,""]
[null,""]
[null,""]
[null,""]
[null,""]
[null,""]
[]
[null,null,null,null,null,null,null,null,null,null,null,null,null,null,null,null,null,null,null,null,null,null,null,null,null,null,null,null,null,null,null,null,null,null,"Totais pagas",{"$f":"SUM(AJ11:AJ510)","v":0},{"$f":"SUM(AK11:AK510)","v":0},0,0,0,{"$f":"SUM(AO11:AO510)","v":0}]

{"sheet":"Guia 20","index":19,"n_rows":512,"n_cols":46,"rows_kept":512,"cut":false,"hidden":true,"merged":[[4,2,4,8],[5,4,5,7],[6,2,6,5],[6,6,6,9],[6,10,6,11],[7,19,8,19],[6,15,6,22],[6,23,6,34],[6,35,6,45],[7,2,8,2],[7,3,8,3],[7,4,8,4],[7,5,8,5],[7,6,8,6],[7,7,8,7],[7,8,8,8],[6,14,8,14],[7,9,8,9],[7,10,8,10],[7,11,8,11],[7,12,8,12],[7,13,8,13],[7,15,8,15],[7,16,8,16],[7,17,8,17],[7,18,8,18],[7,35,7,40],[7,41,7,43],[7,44,7,45],[7,20,8,20],[7,21,8,21],[7,22,8,22],[7,23,7,28],[7,29,7,31],[7,32,7,34]]}
[]
[null,null,"Superior Tribunal de Justiça"]
[null,null,"Secretaria de Processamento de Feitos"]
[null,null,"Coordenadoria de Processamento de Feitos em Execução Judicial"]
[null,null,{"$f":"\"Relação das Requisições de Pequeno Valor - RPV pagas pelo STJ em \"&IF(F11=\"\",\"\",UPPER((TEXT(F11,\"mmmm/aaaa\"))))","v":"Relação das Requisições de Pequeno Valor - RPV pagas pelo STJ em "}]
[]
[null,null,"RPV",null,null,null,"P R O C E S S O     D E     O R I G E M",null,null,null,"E N T I D A D E S",null,"R E Q U E R E N T E","A D V O G A D O","Natureza do crédito","I N D I C A D O R E S",null,null,null,null,null,null,null,"VALORES REQUISITADOS",null,null,null,null,null,null,null,null,null,null,null,"VALORES ATUALIZADOS PARA PAGAMENTO"]
[null,null,"Nº","Registro","Autuada em","data do pgto","Ação","Autuada em","Tipo de causa","Trânsito","Entidade devedora","Órgão de origem","Origem do crédito","Origem do crédito",null,"Tributário","EC 94 2016","Lei 13.463 2017","PRC/RPV de origem","Nº DA GRU","DOENÇA GRAVE","Deficiência física","Isento de IR","Beneficiários",null,null,null,null,null,"PSSS",null,null,"R R A",null,null,"Beneficiários",null,null,null,null,null,"P S S S",null,null,"R R A"]
[null,null,null,null,null,null,null,null,null,null,null,null,null,null,null,null,null,null,null,null,null,null,null,"Total","Adv I","Adv II","Adv III","Adv IV","Requerente","Base","Desc","Patronal","NMA","Exercícios anteriores","Desconto","Total","Adv I","Adv II","Adv III","Adv IV","Reqte","BASE desc","Desc","Patronal","Exercícios anteriores","Dedução"]
[]
[null,{"$f":"IF(C11=\"\",\"\",1)","v":""}]
[null,{"$f":"IF(C12=\"\",\"\",B11+1)","v":""}]
[null,{"$f":"IF(C13=\"\",\"\",B12+1)","v":""}]
[null,""]
[null,""]
[null,""]
[null,""]
[null,""]
[null,""]
[null,""]
[null,""]
[null,""]
[null,""]
[null,""]
[null,""]
[null,""]
[null,""]
[null,""]
[null,""]
[null,""]
[null,""]
[null,""]
[null,""]
[null,""]
[null,""]
[null,""]
[null,""]
[null,""]
[null,""]
[null,""]
[null,""]
[null,""]
[null,""]
[null,""]
[null,""]
[null,""]
[null,""]
[null,""]
[null,""]
[null,""]
[null,""]
[null,""]
[null,""]
[null,""]
[null,""]
[null,""]
[null,""]
[null,""]
[null,""]
[null,""]
[null,""]
[null,""]
[null,""]
[null,""]
[null,""]
[null,""]
[null,""]
[null,""]
[null,""]
[null,""]
[null,""]
[null,""]
[null,""]
[null,""]
[null,""]
[null,""]
[null,{"$f":"IF(C77=\"\",\"\",B76+1)","v":""}]
[null,""]
[null,""]
[null,""]
[null,""]
[null,""]
[null,""]
[null,""]
[null,""]
[null,""]
[null,""]
[null,""]
[null,""]
[null,""]
[null,""]
[null,""]
[null,""]
[null,""]
[null,""]
[null,""]
[null,""]
[null,""]
[null,""]
[null,""]
[null,""]
[null,""]
[null,""]
[null,""]
[null,""]
[null,""]
[null,""]
[null,""]
[null,""]
[null,""]
[null,""]
[null,""]
[null,""]
[null,""]
[null,""]
[null,""]
[null,""]
[null,""]
[null,""]
[null,""]
[null,""]
[null,""]
[null,""]
[null,""]
[null,""]
[null,""]
[null,""]
[null,""]
[null,""]
[null,""]
[null,""]
[null,""]
[null,""]
[null,""]
[null,""]
[null,""]
[null,""]
[null,""]
[null,""]
[null,""]
[null,{"$f":"IF(C141=\"\",\"\",B140+1)","v":""}]
[null,""]
[null,""]
[null,""]
[null,""]
[null,""]
[null,""]
[null,""]
[null,""]
[null,""]
[null,""]
[null,""]
[null,""]
[null,""]
[null,""]
[null,""]
[null,""]
[null,""]
[null,""]
[null,""]
[null,""]
[null,""]
[null,""]
[null,""]
[null,""]
[null,""]
[null,""]
[null,""]
[null,""]
[null,""]
[null,""]
[null,""]
[null,""]
[null,""]
[null,""]
[null,""]
[null,""]
[null,""]
[null,""]
[null,""]
[null,""]
[null,""]
[null,""]
[null,""]
[null,""]
[null,""]
[null,""]
[null,""]
[null,""]
[null,""]
[null,""]
[null,""]
[null,""]
[null,""]
[null,""]
[null,""]
[null,""]
[null,""]
[null,""]
[null,""]
[null,""]
[null,""]
[null,""]
[null,""]
[null,{"$f":"IF(C205=\"\",\"\",B204+1)","v":""}]
[null,""]
[null,""]
[null,""]
[null,""]
[null,""]
[null,""]
[null,""]
[null,""]
[null,""]
[null,""]
[null,""]
[null,""]
[null,""]
[null,""]
[null,""]
[null,""]
[null,""]
[null,""]
[null,""]
[null,""]
[null,""]
[null,""]
[null,""]
[null,""]
[null,""]
[null,""]
[null,""]
[null,""]
[null,""]
[null,""]
[null,""]
[null,""]
[null,""]
[null,""]
[null,""]
[null,""]
[null,""]
[null,""]
[null,""]
[null,""]
[null,""]
[null,""]
[null,""]
[null,""]
[null,""]
[null,""]
[null,""]
[null,""]
[null,""]
[null,""]
[null,""]
[null,""]
[null,""]
[null,""]
[null,""]
[null,""]
[null,""]
[null,""]
[null,""]
[null,""]
[null,""]
[null,""]
[null,""]
[null,{"$f":"IF(C269=\"\",\"\",B268+1)","v":""}]
[null,""]
[null,""]
[null,""]
[null,""]
[null,""]
[null,""]
[null,""]
[null,""]
[null,""]
[null,""]
[null,""]
[null,""]
[null,""]
[null,""]
[null,""]
[null,""]
[null,""]
[null,""]
[null,""]
[null,""]
[null,""]
[null,""]
[null,""]
[null,""]
[null,""]
[null,""]
[null,""]
[null,""]
[null,""]
[null,""]
[null,""]
[null,""]
[null,""]
[null,""]
[null,""]
[null,""]
[null,""]
[null,""]
[null,""]
[null,""]
[null,""]
[null,""]
[null,""]
[null,""]
[null,""]
[null,""]
[null,""]
[null,""]
[null,""]
[null,""]
[null,""]
[null,""]
[null,""]
[null,""]
[null,""]
[null,""]
[null,""]
[null,""]
[null,""]
[null,""]
[null,""]
[null,""]
[null,""]
[null,{"$f":"IF(C333=\"\",\"\",B332+1)","v":""}]
[null,""]
[null,""]
[null,""]
[null,""]
[null,""]
[null,""]
[null,""]
[null,""]
[null,""]
[null,""]
[null,""]
[null,""]
[null,""]
[null,""]
[null,""]
[null,""]
[null,""]
[null,""]
[null,""]
[null,""]
[null,""]
[null,""]
[null,""]
[null,""]
[null,""]
[null,""]
[null,""]
[null,""]
[null,""]
[null,""]
[null,""]
[null,""]
[null,""]
[null,""]
[null,""]
[null,""]
[null,""]
[null,""]
[null,""]
[null,""]
[null,""]
[null,""]
[null,""]
[null,""]
[null,""]
[null,""]
[null,""]
[null,""]
[null,""]
[null,""]
[null,""]
[null,""]
[null,""]
[null,""]
[null,""]
[null,""]
[null,""]
[null,""]
[null,""]
[null,""]
[null,""]
[null,""]
[null,""]
[null,{"$f":"IF(C397=\"\",\"\",B396+1)","v":""}]
[null,""]
[null,""]
[null,""]
[null,""]
[null,""]
[null,""]
[null,""]
[null,""]
[null,""]
[null,""]
[null,""]
[null,""]
[null,""]
[null,""]
[null,""]
[null,""]
[null,""]
[null,""]
[null,""]
[null,""]
[null,""]
[null,""]
[null,""]
[null,""]
[null,""]
[null,""]
[null,""]
[null,""]
[null,""]
[null,""]
[null,""]
[null,""]
[null,""]
[null,""]
[null,""]
[null,""]
[null,""]
[null,""]
[null,""]
[null,""]
[null,""]
[null,""]
[null,""]
[null,""]
[null,""]
[null,""]
[null,""]
[null,""]
[null,""]
[null,""]
[null,""]
[null,""]
[null,""]
[null,""]
[null,""]
[null,""]
[null,""]
[null,""]
[null,""]
[null,""]
[null,""]
[null,""]
[null,""]
[null,{"$f":"IF(C461=\"\",\"\",B460+1)","v":""}]
[null,""]
[null,""]
[null,""]
[null,""]
[null,""]
[null,""]
[null,""]
[null,""]
[null,""]
[null,""]
[null,""]
[null,""]
[null,""]
[null,""]
[null,""]
[null,""]
[null,""]
[null,""]
[null,""]
[null,""]
[null,""]
[null,""]
[null,""]
[null,""]
[null,""]
[null,""]
[null,""]
[null,""]
[null,""]
[null,""]
[null,""]
[null,""]
[null,""]
[null,""]
[null,""]
[null,""]
[null,""]
[null,""]
[null,""]
[null,""]
[null,""]
[null,""]
[null,""]
[null,""]
[null,""]
[null,""]
[null,""]
[null,""]
[null,""]
[]
[null,null,null,null,null,null,null,null,null,null,null,null,null,null,null,null,null,null,null,null,null,null,null,null,null,null,null,null,null,null,null,null,null,null,"Totais pagas",{"$f":"SUM(AJ11:AJ510)","v":0},{"$f":"SUM(AK11:AK510)","v":0},0,0,0,{"$f":"SUM(AO11:AO510)","v":0}]