{"text_format":"1","workbook":"xlsx","n_sheets":20,"sheets":["Pagas (Portal)","Guia 2","Guia 3","Guia 4","Guia 5","Guia 6","Guia 7","Guia 8","Guia 9","Guia 10","Guia 11","Guia 12","Guia 13","Guia 14","Guia 15","Guia 16","Guia 17","Guia 18","Guia 19","Guia 20"],"not_rendered":{"charts":0,"images":0,"macros":1,"external_links":0,"defined_names":296,"comments":0,"pivot_tables":0},"unopened":[],"bounds":{"document_bytes":16777216,"sheet_cells":100000,"rows_first":2000,"rows_last":500,"rows_between":2000,"halvings":0,"cell_chars":16384,"cell_head_chars":4096},"cells_cut":0,"cells_raw":0,"read":"whole","date_system":"1900"}

{"sheet":"Pagas (Portal)","index":0,"n_rows":511,"n_cols":46,"rows_kept":511,"cut":false,"hidden":false,"merged":[[7,12,8,12],[7,13,8,13],[6,14,8,14],[7,21,8,21],[7,22,8,22],[6,15,6,22],[7,29,7,31],[7,32,7,34],[7,35,7,40],[7,15,8,15],[7,16,8,16],[7,17,8,17],[7,18,8,18],[7,19,8,19],[6,35,6,45],[7,2,8,2],[7,3,8,3],[7,4,8,4],[7,5,8,5],[7,6,8,6],[6,10,6,11],[7,20,8,20],[7,7,8,7],[7,8,8,8],[7,9,8,9],[7,10,8,10],[7,11,8,11],[7,41,7,43],[7,44,7,45],[7,23,7,28],[4,2,4,8],[5,4,5,7],[6,2,6,5],[6,6,6,9],[6,23,6,34]]}
[]
[null,null,"Superior Tribunal de Justiça"]
[null,null,"Secretaria de Processamento de Feitos"]
[null,null,"Coordenadoria de Processamento de Feitos em Execução Judicial"]
[null,null,{"$f":"\"Relação das Requisições de Pequeno Valor - RPV pagas pelo STJ em \"&IF(F11=\"\",\"\",UPPER((TEXT(F11,\"mmmm/aaaa\"))))","v":"Relação das Requisições de Pequeno Valor - RPV pagas pelo STJ em AGOSTO/2025"}]
[]
[null,null,"RPV",null,null,null,"P R O C E S S O     D E     O R I G E M",null,null,null,"E N T I D A D E S",null,"R E Q U E R E N T E","A D V O G A D O","Natureza do crédito","I N D I C A D O R E S",null,null,null,null,null,null,null,"VALORES REQUISITADOS",null,null,null,null,null,null,null,null,null,null,null,"VALORES ATUALIZADOS PARA PAGAMENTO"]
[null,null,"Nº","Registro","Autuada em","data do pgto","Ação","Autuada em","Tipo de causa","Trânsito","Entidade devedora","Órgão de origem","Origem do crédito","Origem do crédito",null,"Tributário","EC 94 2016","Lei 13.463 2017","PRC/RPV de origem","Nº DA GRU","DOENÇA GRAVE","Deficiência física","Isento de IR","Beneficiários",null,null,null,null,null,"PSSS",null,null,"R R A",null,null,"Beneficiários",null,null,null,null,null,"P S S S",null,null,"R R A"]
[null,null,null,null,null,null,null,null,null,null,null,null,null,null,null,null,null,null,null,null,null,null,null,"Total","Adv I","Adv II","Adv III","Adv IV","Requerente","Base","Desc","Patronal","NMA","Exercícios anteriores","Desconto","Total","Adv I","Adv II","Adv III","Adv IV","Reqte","BASE desc","Desc","Patronal","Exercícios anteriores","Dedução"]
[]
[null,{"$f":"IF(C11=\"\",\"\",1)","v":1},18459,"0151112-22.2024.3.00.0000","2024-04-26","2025-08-01","MS 23.289/DF","2017-02-13","Administrativo - Militar - Regime - Anistia Política","2018-06-28","União","-","Honorários de sucumbência","x.x.x","Alimentar","Não","Não","Não","-","-","Não informada","Não Informada","NÃO",11881.19,0,0,0,0,11881.19,0,0,0,0,0,0,13701.38,0,0,0,0,13701.38,0,0,0,0,0]
[null,{"$f":"IF(C12=\"\",\"\",B11+1)","v":2},19066,"0359476-96.2024.3.00.0000","2024-09-20","2025-08-01","MS 6.040/DF","1998-11-16","Administrativo - Servidor Público Civil - Sistema Remuneratório e Benefícios (PRINCIPAL)","2003-10-01","União","Superintendência de Seguros Privados - SUSEP","Incorporação da diferença de 3,17%","Dedução de Honorários Contratuais","Alimentar","Não","Não","Não","-","-","Não informada","Não Informada","NÃO",10144.86,507.24,507.24,0,0,9130.3799999999992,14619.79,1608.17,3216.34,42,2716.46,1608.17,10994.49,549.72,549.72,0,0,9895.0499999999993,16232.35,1785.55,3571.1,2943.96,1785.55]
[null,{"$f":"IF(C13=\"\",\"\",B12+1)","v":3},19217,"0411722-69.2024.3.00.0000","2024-10-29","2025-08-01","MS 6.019/DF","1998-10-22","Administrativo - Servidor Público Civil - Sistema Remuneratório e Benefícios","2007-12-10","Instituto Nacional do Seguro Social – INSS","Instituto Nacional do Seguro Social - INSS","Reajuste Salarial - Resíduo de 3,17%","Dedução de Honorários Contratuais","Alimentar","Não","Não","Não","-","-","Não informada","Não Informada","NÃO",40713.06,2646.34,0,0,0,38066.720000000001,18382.009999999998,2022.02,4044.04,25,15735.67,2022.02,43843.17,2849.8,0,0,0,40993.370000000003,19795.259999999998,2177.4699999999998,4354.9399999999996,16945.46,2177.4699999999998]
[null,4,19342,"0473793-10.2024.3.00.0000","2024-12-11","2025-08-01","MS 6.019/DF","1998-10-22","Administrativo - Servidor Público Civil - Sistema Remuneratório e Benefícios","2007-12-10","Instituto Nacional do Seguro Social – INSS","Instituto Nacional do Seguro Social - INSS","Reajuste Salarial - Resíduo de 3,17%","Dedução de Honorários Contratuais","Alimentar","Não","Não","Não","-","-","Não informada","Não Informada","NÃO",40299.03,2619.4299999999998,0,0,0,37679.599999999999,0,0,0,19,14467.26,0,42841.35,2784.68,0,0,0,40056.67,0,0,0,15379.95,0]
[null,5,19349,"0473876-26.2024.3.00.0000","2024-12-11","2025-08-01","AR 1.169/CE","1999-10-18","Administrativo - Servidor Público Civil - Sistema Remuneratório e Benefícios","2004-06-07","Instituto Nacional do Seguro Social – INSS","Instituto Nacional do Seguro Social - INSS","Anuênios","Dedução de Honorários Contratuais","Alimentar","Não","Não","Não","-","-","Não informada","Não Informada","NÃO",10298.620000000001,1029.8599999999999,0,0,0,9268.76,4667.33,513.4,1026.8,47,3637.47,513.4,10948.31,1094.83,0,0,0,9853.48,4961.7700000000004,545.79,1091.58,3866.94,545.79]
[null,6,19350,"0473906-61.2024.3.00.0000","2024-12-11","2025-08-01","AR 1.169/CE","1999-10-18","Administrativo - Servidor Público Civil - Sistema Remuneratório e Benefícios","2004-06-07","Instituto Nacional do Seguro Social – INSS","Instituto Nacional do Seguro Social - INSS","Anuênios","Dedução de Honorários Contratuais","Alimentar","Não","Não","Não","-","-","Não informada","Não Informada","NÃO",16072.63,1607.26,0,0,0,14465.37,7284.12,801.25,1602.5,47,5676.86,801.25,17086.59,1708.65,0,0,0,15377.94,7743.65,851.8,1703.6,6035,851.8]
[null,7,19355,"0473931-74.2024.3.00.0000","2024-12-11","2025-08-01","AR 1.169/CE","1999-10-18","Administrativo - Servidor Público Civil - Sistema Remuneratório e Benefícios","2004-06-07","Instituto Nacional do Seguro Social – INSS","Instituto Nacional do Seguro Social - INSS","Anuênios","Dedução de Honorários Contratuais","Alimentar","Não","Não","Não","-","-","Não informada","Não Informada","NÃO",15159.66,1515.96,0,0,0,13643.7,6870.37,755.74,1511.48,47,5354.41,755.74,16116.02,1611.6,0,0,0,14504.42,7303.79,803.41,1606.82,5692.19,803.41]
[null,8,19357,"0473936-96.2024.3.00.0000","2024-12-11","2025-08-01","AR 1.169/CE","1999-10-18","Administrativo - Servidor Público Civil - Sistema Remuneratório e Benefícios","2004-06-07","Instituto Nacional do Seguro Social – INSS","Instituto Nacional do Seguro Social - INSS","Anuênios","Dedução de Honorários Contratuais","Alimentar","Não","Não","Não","-","-","Não informada","Não Informada","NÃO",4787.9399999999996,478.79,0,0,0,4309.1499999999996,2169.89,238.68,477.36,47,1691.1,238.68,5089.99,508.99,0,0,0,4581,2306.7800000000002,253.74,507.48,1797.79,253.74]
[null,9,19360,"0474002-76.2024.3.00.0000","2024-12-11","2025-08-01","AR 1.169/CE","1999-10-18","Administrativo - Servidor Público Civil - Sistema Remuneratório e Benefícios","2004-06-07","Instituto Nacional do Seguro Social – INSS","Instituto Nacional do Seguro Social - INSS","Anuênios","Dedução de Honorários Contratuais","Alimentar","Não","Não","Não","-","-","Não informada","Não Informada","NÃO",4229.2299999999996,422.92,0,0,0,3806.31,1916.69,210.83,421.66,47,1493.77,210.83,4496.03,449.6,0,0,0,4046.43,2037.6,224.13,448.26,1588,224.13]
[null,10,19362,"0474008-83.2024.3.00.0000","2024-12-11","2025-08-01","AR 1.169/CE","1999-10-18","Administrativo - Servidor Público Civil - Sistema Remuneratório e Benefícios","2004-06-07","Instituto Nacional do Seguro Social – INSS","Instituto Nacional do Seguro Social - INSS","Anuênios","Dedução de Honorários Contratuais","Alimentar","Não","Não","Não","-","-","Não informada","Não Informada","NÃO",17345.400000000001,1734.54,0,0,0,15610.86,7860.93,864.7,1729.4,47,6126.39,864.7,18439.650000000001,1843.96,0,0,0,16595.689999999999,8356.84,919.25,1838.5,6512.88,919.25]
[null,11,19371,"0474277-25.2024.3.00.0000","2024-12-11","2025-08-01","AR 1.169/CE","1999-10-18","Administrativo - Servidor Público Civil - Sistema Remuneratório e Benefícios","2004-06-07","Instituto Nacional do Seguro Social – INSS","Instituto Nacional do Seguro Social - INSS","Anuênios","Dedução de Honorários Contratuais","Alimentar","Não","Não","Não","-","-","Não informada","Não Informada","NÃO",10626.48,1062.6400000000001,0,0,0,9563.84,4815.91,529.75,1059.5,47,3753.27,529.75,11296.85,1129.68,0,0,0,10167.17,5119.72,563.16,1126.32,3990.04,563.16]
[null,12,19374,"0474302-38.2024.3.00.0000","2024-12-11","2025-08-01","AR 1.169/CE","1999-10-18","Administrativo - Servidor Público Civil - Sistema Remuneratório e Benefícios","2004-06-07","Instituto Nacional do Seguro Social – INSS","Instituto Nacional do Seguro Social - INSS","Anuênios","Dedução de Honorários Contratuais","Alimentar","Não","Não","Não","-","-","Não informada","Não Informada","NÃO",15519.55,1551.95,0,0,0,13967.6,7033.46,773.68,1547.36,47,5481.51,773.68,16498.61,1649.86,0,0,0,14848.75,7477.17,822.48,1644.96,5827.31,822.48]
[null,13,19425,"0478530-56.2024.3.00.0000","2024-12-13","2025-08-01","AR 1.169/CE","1999-10-18","Administrativo - Servidor Público Civil - Sistema Remuneratório e Benefícios","2004-06-07","Instituto Nacional do Seguro Social – INSS","Instituto Nacional do Seguro Social - INSS","Anuênios","Dedução de Honorários Contratuais","Alimentar","Não","Não","Não","-","-","Não informada","Não Informada","NÃO",4490.01,449,0,0,0,4041.01,2034.87,223.83,447.66,47,1585.87,223.83,4773.26,477.32,0,0,0,4295.9399999999996,2163.2399999999998,237.95,475.9,1685.92,237.95]
[null,14,19426,"0478538-33.2024.3.00.0000","2024-12-13","2025-08-01","AR 1.169/CE","1999-10-18","Administrativo - Servidor Público Civil - Sistema Remuneratório e Benefícios","2004-06-07","Instituto Nacional do Seguro Social – INSS","Instituto Nacional do Seguro Social - INSS","Anuênios","Dedução de Honorários Contratuais","Alimentar","Não","Não","Não","-","-","Não informada","Não Informada","NÃO",5127.1099999999997,512.71,0,0,0,4614.3999999999996,2323.61,255.59,511.18,47,1810.9,255.59,5450.55,545.04999999999995,0,0,0,4905.5,2470.19,271.72000000000003,543.44000000000005,1925.14,271.72000000000003]
[null,15,19429,"0478584-22.2024.3.00.0000","2024-12-13","2025-08-01","AR 1.169/CE","1999-10-18","Administrativo - Servidor Público Civil - Sistema Remuneratório e Benefícios","2004-06-07","Instituto Nacional do Seguro Social – INSS","Instituto Nacional do Seguro Social - INSS","Anuênios","Dedução de Honorários Contratuais","Alimentar","Não","Não","Não","-","-","Não informada","Não Informada","NÃO",7426.89,742.68,0,0,0,6684.21,3365.87,370.24,740.48,47,2623.19,370.24,7895.42,789.54,0,0,0,7105.88,3578.21,393.6,787.2,2788.67,393.6]
[null,16,19572,"0037904-26.2025.3.00.0000","2025-02-07","2025-08-01","MS 23.672/DF","2017-08-03","Administrativo - Militar - Regime - Anistia Política (PRINCIPAL)","2019-08-26","União","-","Honorários de sucumbência","x.x.x","Alimentar","Não","Não","Não","-","-","Não informada","Não Informada","NÃO",21122.77,0,0,0,0,21122.77,0,0,0,0,0,0,22502.080000000002,0,0,0,0,22502.080000000002,0,0,0,0,0]
[null,17,19573,"0037920-77.2025.3.00.0000","2025-02-07","2025-08-01","MS 27.926/DF","2021-07-14","Administrativo - Militar - Regime - Anistia Política (PRINCIPAL)","2022-03-14","União","-","Honorários de sucumbência","x.x.x","Alimentar","Não","Não","Não","-","-","Não informada","Não Informada","NÃO",44873.31,0,0,0,0,44873.31,0,0,0,0,0,0,47076.32,0,0,0,0,47076.32,0,0,0,0,0]
[null,18,19620,"0051233-08.2025.3.00.0000","2025-02-17","2025-08-01","MS 20.231/DF","2013-06-06","Administrativo - Servidor Público Civil - Sistema Remuneratório e Benefícios (PRINCIPAL)","2017-04-29","União","Ministério do Planejamento, Orçamento e Gestão","Gratificação de Apoio à Execução de Atividades da Comissão Executiva do Plano da Lavoura Cacaueira - GECEPLAC","Dedução de Honorários Contratuais","Alimentar","Não","Não","Não","-","-","Não informada","Não Informada","NÃO",71064.490000000005,7106.44,0,0,0,63958.05,54200.84,5962.09,0,41,47094.400000000001,5962.09,74471.61,7447.16,0,0,0,67024.45,56799.45,6247.93,0,49352.29,6247.93]
[null,19,19660,"0057005-49.2025.3.00.0000","2025-02-20","2025-08-01","MS 20.231/DF","2013-06-06","Administrativo - Servidor Público Civil - Sistema Remuneratório e Benefícios (PRINCIPAL)","2017-04-29","União","Ministério do Planejamento, Orçamento e Gestão","Gratificação de Apoio à Execução de Atividades da Comissão Executiva do Plano da Lavoura Cacaueira - GECEPLAC","Dedução de Honorários Contratuais","Alimentar","Não","Não","Não","-","-","Não informada","Não Informada","NÃO",22063.24,2206.3200000000002,0,0,0,19856.919999999998,15708.88,1727.97,0,65,13502.56,1727.97,23121.03,2312.1,0,0,0,20808.93,16462.02,1810.82,0,14149.92,1810.82]
[null,20,19682,"0059843-62.2025.3.00.0000","2025-02-21","2025-08-01","MS 3.099/DF","1993-09-15","Administrativo - Servidor Público Civil - Reajustes de Remuneração, Proventos ou Pensão - Índice de 28,86% Lei 8.622/1993 e 8.627/1993","2000-06-07","União","Ministério da Saúde","Índice de 28,86% Lei 8.622/1993 e 8.627/1993","Dedução de Honorários Contratuais","Alimentar","Não","Não","Não","-","-","Não informada","Não Informada","NÃO",3195.91,319.58999999999997,0,0,0,2876.32,1078.06,118.58,237.16,63,758.47,118.58,3349.12,334.91,0,0,0,3014.21,1129.74,124.27,248.54,794.83,124.27]
[null,21,19683,"0059856-61.2025.3.00.0000","2025-02-21","2025-08-01","MS 3.099/DF","1993-09-15","Administrativo - Servidor Público Civil - Reajustes de Remuneração, Proventos ou Pensão - Índice de 28,86% Lei 8.622/1993 e 8.627/1993","2000-06-07","União","Ministério da Saúde","Índice de 28,86% Lei 8.622/1993 e 8.627/1993","Dedução de Honorários Contratuais","Alimentar","Não","Não","Não","-","-","Não informada","Não Informada","NÃO",2767.56,276.75,0,0,0,2490.81,971.32,106.84,213.68,63,694.57,106.84,2900.23,290.02,0,0,0,2610.21,1017.88,111.96,223.92,727.86,111.96]
[null,22,19684,"0059865-23.2025.3.00.0000","2025-02-21","2025-08-01","MS 3.099/DF","1993-09-15","Administrativo - Servidor Público Civil - Reajustes de Remuneração, Proventos ou Pensão - Índice de 28,86% Lei 8.622/1993 e 8.627/1993","2000-06-07","União","Ministério da Saúde","Índice de 28,86% Lei 8.622/1993 e 8.627/1993","Dedução de Honorários Contratuais","Alimentar","Não","Não","Não","-","-","Não informada","Não Informada","NÃO",2619.9699999999998,261.99,0,0,0,2357.98,888.82,97.77,195.54,63,626.83000000000004,97.77,2745.57,274.55,0,0,0,2471.02,931.43,102.45,204.9,656.88,102.45]
[null,23,19685,"0059871-30.2025.3.00.0000","2025-02-21","2025-08-01","MS 3.099/DF","1993-09-15","Administrativo - Servidor Público Civil - Reajustes de Remuneração, Proventos ou Pensão - Índice de 28,86% Lei 8.622/1993 e 8.627/1993","2000-06-07","União","Ministério da Saúde","Índice de 28,86% Lei 8.622/1993 e 8.627/1993","Dedução de Honorários Contratuais","Alimentar","Não","Não","Não","-","-","Não informada","Não Informada","NÃO",4553.01,455.3,0,0,0,4097.71,1519.73,167.17,334.34,63,1064.43,167.17,4771.29,477.12,0,0,0,4294.17,1592.59,175.18,350.36,1115.47,175.18]
[null,24,19686,"0059878-22.2025.3.00.0000","2025-02-21","2025-08-01","MS 3.099/DF","1993-09-15","Administrativo - Servidor Público Civil - Reajustes de Remuneração, Proventos ou Pensão - Índice de 28,86% Lei 8.622/1993 e 8.627/1993","2000-06-07","União","Ministério da Saúde","Índice de 28,86% Lei 8.622/1993 e 8.627/1993","Dedução de Honorários Contratuais","Alimentar","Não","Não","Não","-","-","Não informada","Não Informada","NÃO",28341.7,2834.17,0,0,0,25507.53,5629.64,619.26,1238.52,63,7739.29,619.26,29700.51,2970.05,0,0,0,26730.46,5997.25,659.69,1319.38,8110.34,659.69]
[null,25,19693,"0059973-52.2025.3.00.0000","2025-02-21","2025-08-01","MS 10.438/DF","2005-02-22","Administrativo - Militar - Pensão","2007-09-13","União","Ministério da Fazenda","Soldo previsto na Lei Estadual 1.063/2002","Dedução de Honorários Contratuais","Alimentar","Não","Não","Não","-","-","Não informada","Não Informada","NÃO",77290.63,15844.57,8115.51,0,0,53330.55,0,0,0,19,36608.129999999997,0,80996.259999999995,16604.23,8504.6,0,0,55887.43,0,0,0,38363.269999999997,0]
[null,26,19694,"0059976-07.2025.3.00.0000","2025-02-21","2025-08-01","MS 10.438/DF","2005-02-22","Administrativo - Militar - Pensão","2007-09-13","União","Ministério da Fazenda","Soldo previsto na Lei Estadual 1.063/2002","Dedução de Honorários Contratuais","Alimentar","Não","Não","Não","-","-","Não informada","Não Informada","NÃO",59289.67,12154.38,6225.41,0,0,40909.879999999997,0,0,0,18,28119.79,0,62132.25,12737.11,6523.88,0,0,42871.26,0,0,0,29467.97,0]
[null,27,19734,"0063790-27.2025.3.00.0000","2025-02-25","2025-08-01","MS 6.019/DF","1998-10-22","Administrativo - Servidor Público Civil - Sistema Remuneratório e Benefícios","2007-12-10","Instituto Nacional do Seguro Social – INSS","Instituto Nacional do Seguro Social - INSS","Reajuste Salarial - Resíduo de 3,17%","Dedução de Honorários Contratuais","Alimentar","Não","Não","Não","-","-","Não informada","Não Informada","NÃO",46007.28,2990.47,0,0,0,43016.81,0,0,0,43,17312.05,0,48225.599999999999,3134.66,0,0,0,45090.94,0,0,0,18146.78,0]
[null,28,19740,"0063891-64.2025.3.00.0000","2025-02-25","2025-08-01","MS 6.019/DF","1998-10-22","Administrativo - Servidor Público Civil - Sistema Remuneratório e Benefícios","2007-12-10","Instituto Nacional do Seguro Social – INSS","Instituto Nacional do Seguro Social - INSS","Reajuste Salarial - Resíduo de 3,17%","Dedução de Honorários Contratuais","Alimentar","Não","Não","Não","-","-","Não informada","Não Informada","NÃO",17983.48,1168.92,0,0,0,16814.560000000001,0,0,0,43,6837.45,0,18850.580000000002,1225.28,0,0,0,17625.3,0,0,0,7167.13,0]
[null,29,19743,"0063925-39.2025.3.00.0000","2025-02-25","2025-08-01","MS 6.019/DF","1998-10-22","Administrativo - Servidor Público Civil - Sistema Remuneratório e Benefícios","2007-12-10","Instituto Nacional do Seguro Social – INSS","Instituto Nacional do Seguro Social - INSS","Reajuste Salarial - Resíduo de 3,17%","Dedução de Honorários Contratuais","Alimentar","Não","Não","Não","-","-","Não informada","Não Informada","NÃO",16233.26,1055.1600000000001,0,0,0,15178.1,0,0,0,43,6245.6,0,17015.96,1106.03,0,0,0,15909.93,0,0,0,6546.74,0]
[null,30,19749,"0064008-55.2025.3.00.0000","2025-02-25","2025-08-01","MS 6.019/DF","1998-10-22","Administrativo - Servidor Público Civil - Sistema Remuneratório e Benefícios","2007-12-10","Instituto Nacional do Seguro Social – INSS","Instituto Nacional do Seguro Social - INSS","Reajuste Salarial - Resíduo de 3,17%","Dedução de Honorários Contratuais","Alimentar","Não","Não","Não","-","-","Não informada","Não Informada","NÃO",38601.64,2509.1,0,0,0,36092.54,0,0,0,43,14702.91,0,40452.35,2629.4,0,0,0,37822.949999999997,0,0,0,15407.82,0]
[null,31,19768,"0066536-62.2025.3.00.0000","2025-02-26","2025-08-01","MS 23.011/DF","2016-12-09","Administrativo - Militar - Regime - Anistia Política","2017-06-13","União","-","Honorários de sucumbência","x.x.x","Alimentar","Não","Não","Não","-","-","Não informada","Não Informada","NÃO",18613.29,0,0,0,0,18613.29,0,0,0,0,0,0,19828.73,0,0,0,0,19828.73,0,0,0,0,0]
[null,32,19770,"0068459-26.2025.3.00.0000","2025-02-27","2025-08-01","MS 6.019/DF","1998-10-22","Administrativo - Servidor Público Civil - Sistema Remuneratório e Benefícios","2007-12-10","Instituto Nacional do Seguro Social – INSS","Instituto Nacional do Seguro Social - INSS","Reajuste Salarial - Resíduo de 3,17%","Dedução de Honorários Contratuais","Alimentar","Não","Não","Não","-","-","Não informada","Não Informada","NÃO",42779.77,2780.68,0,0,0,39999.089999999997,0,0,0,43,16769.689999999999,0,44830.8,2914,0,0,0,41916.800000000003,0,0,0,17573.689999999999,0]
[null,33,19772,"0068484-39.2025.3.00.0000","2025-02-27","2025-08-01","MS 6.019/DF","1998-10-22","Administrativo - Servidor Público Civil - Sistema Remuneratório e Benefícios","2007-12-10","Instituto Nacional do Seguro Social – INSS","Instituto Nacional do Seguro Social - INSS","Reajuste Salarial - Resíduo de 3,17%","Dedução de Honorários Contratuais","Alimentar","Não","Não","Não","-","-","Não informada","Não Informada","NÃO",46986.27,3054.1,0,0,0,43932.17,0,0,0,40,18667.330000000002,0,49238.98,3200.53,0,0,0,46038.45,0,0,0,19562.310000000001,0]
[null,34,19785,"0068618-66.2025.3.00.0000","2025-02-27","2025-08-01","MS 6.019/DF","1998-10-22","Administrativo - Servidor Público Civil - Sistema Remuneratório e Benefícios","2007-12-10","Instituto Nacional do Seguro Social – INSS","Instituto Nacional do Seguro Social - INSS","Reajuste Salarial - Resíduo de 3,17%","Dedução de Honorários Contratuais","Alimentar","Não","Não","Não","-","-","Não informada","Não Informada","NÃO",37525.42,2439.15,0,0,0,35086.269999999997,0,0,0,43,14114.57,0,39324.54,2556.09,0,0,0,36768.449999999997,0,0,0,14791.28,0]
[null,35,19788,"0068646-34.2025.3.00.0000","2025-02-27","2025-08-01","MS 6.019/DF","1998-10-22","Administrativo - Servidor Público Civil - Sistema Remuneratório e Benefícios","2007-12-10","Instituto Nacional do Seguro Social – INSS","Instituto Nacional do Seguro Social - INSS","Reajuste Salarial - Resíduo de 3,17%","Dedução de Honorários Contratuais","Alimentar","Não","Não","Não","-","-","Não informada","Não Informada","NÃO",49484.800000000003,3216.51,0,0,0,46268.29,0,0,0,43,19186.13,0,51857.3,3370.72,0,0,0,48486.58,0,0,0,20105.990000000002,0]
[null,36,19806,"0069384-22.2025.3.00.0000","2025-02-28","2025-08-01","MS 21.601/DF","2015-02-20","Administrativo - Servidor Público Civil - Sistema Remuneratório e Benefícios (PRINCIPAL)","2017-06-27","União","Ministério do Planejamento, Orçamento e Gestão","Incorporação de gratificação de apoio - GCEPLAC - Lei 12.702/12","Dedução de Honorários Contratuais","Alimentar","Não","Não","Não","-","-","Não informada","Não Informada","NÃO",54395.65,5439.56,2719.78,0,0,46236.31,45217.41,4973.91,0,77,37058.07,4973.91,57003.6,5700.36,2850.18,0,0,48453.06,47385.32,5212.38,0,38834.78,5212.38]
[null,37,19807,"0069386-89.2025.3.00.0000","2025-02-28","2025-08-01","MS 21.601/DF","2015-02-20","Administrativo - Servidor Público Civil - Sistema Remuneratório e Benefícios (PRINCIPAL)","2017-06-27","União","Ministério do Planejamento, Orçamento e Gestão","Incorporação de gratificação de apoio - GCEPLAC - Lei 12.702/12","Dedução de Honorários Contratuais","Alimentar","Não","Não","Não","-","-","Não informada","Não Informada","NÃO",32113.01,3211.3,1605.65,0,0,27296.06,26702.03,2937.22,0,77,21885.08,2937.22,33652.629999999997,3365.26,1682.63,0,0,28604.74,27982.23,3078.04,0,22934.34,3078.04]
[null,38,19808,"0069389-44.2025.3.00.0000","2025-02-28","2025-08-01","MS 21.601/DF","2015-02-20","Administrativo - Servidor Público Civil - Sistema Remuneratório e Benefícios (PRINCIPAL)","2017-06-27","União","Ministério do Planejamento, Orçamento e Gestão","Incorporação de gratificação de apoio - GCEPLAC - Lei 12.702/12","Dedução de Honorários Contratuais","Alimentar","Não","Não","Não","-","-","Não informada","Não Informada","NÃO",32113.01,3211.3,1605.65,0,0,27296.06,26702.03,2937.22,0,77,21885.08,2937.22,33652.629999999997,3365.26,1682.63,0,0,28604.74,27982.23,3078.04,0,22934.34,3078.04]
[null,39,19809,"0069392-96.2025.3.00.0000","2025-02-28","2025-08-01","MS 21.601/DF","2015-02-20","Administrativo - Servidor Público Civil - Sistema Remuneratório e Benefícios (PRINCIPAL)","2017-06-27","União","Ministério do Planejamento, Orçamento e Gestão","Incorporação de gratificação de apoio - GCEPLAC - Lei 12.702/12","Dedução de Honorários Contratuais","Alimentar","Não","Não","Não","-","-","Não informada","Não Informada","NÃO",30611.33,3061.13,1530.56,0,0,26019.64,1822.3,200.45,0,77,20177.240000000002,200.45,32078.95,3207.89,1603.94,0,0,27267.119999999999,1941.29,213.54,0,21144.62,213.54]
[null,40,19810,"0069398-06.2025.3.00.0000","2025-02-28","2025-08-01","MS 21.601/DF","2015-02-20","Administrativo - Servidor Público Civil - Sistema Remuneratório e Benefícios (PRINCIPAL)","2017-06-27","União","Ministério do Planejamento, Orçamento e Gestão","Incorporação de gratificação de apoio - GCEPLAC - Lei 12.702/12","Dedução de Honorários Contratuais","Alimentar","Não","Não","Não","-","-","Não informada","Não Informada","NÃO",32995.19,3299.51,1649.75,0,0,28045.93,1818.25,200,0,77,21752.77,200,34577.1,3457.71,1728.85,0,0,29390.54,1936.98,213.06,0,22795.67,213.06]
[null,41,19811,"0069401-58.2025.3.00.0000","2025-02-28","2025-08-01","MS 21.601/DF","2015-02-20","Administrativo - Servidor Público Civil - Sistema Remuneratório e Benefícios (PRINCIPAL)","2017-06-27","União","Ministério do Planejamento, Orçamento e Gestão","Incorporação de gratificação de apoio - GCEPLAC - Lei 12.702/12","Dedução de Honorários Contratuais","Alimentar","Não","Não","Não","-","-","Não informada","Não Informada","NÃO",11925.47,1192.54,596.27,0,0,10136.66,0,0,0,77,7860.78,0,12497.22,1249.72,624.86,0,0,10622.64,0,0,0,8237.65,0]
[null,42,19812,"0069402-43.2025.3.00.0000","2025-02-28","2025-08-01","MS 21.601/DF","2015-02-20","Administrativo - Servidor Público Civil - Sistema Remuneratório e Benefícios (PRINCIPAL)","2017-06-27","União","Ministério do Planejamento, Orçamento e Gestão","Incorporação de gratificação de apoio - GCEPLAC - Lei 12.702/12","Dedução de Honorários Contratuais","Alimentar","Não","Não","Não","-","-","Não informada","Não Informada","NÃO",29794.14,2979.41,1489.7,0,0,25325.03,24768.92,2724.58,0,77,20299.810000000001,2724.58,31222.59,3122.25,1561.12,0,0,26539.22,25956.44,2855.2,0,21273.07,2855.2]
[null,43,19813,"0069408-50.2025.3.00.0000","2025-02-28","2025-08-01","MS 21.601/DF","2015-02-20","Administrativo - Servidor Público Civil - Sistema Remuneratório e Benefícios (PRINCIPAL)","2017-06-27","União","Ministério do Planejamento, Orçamento e Gestão","Incorporação de gratificação de apoio - GCEPLAC - Lei 12.702/12","Dedução de Honorários Contratuais","Alimentar","Não","Não","Não","-","-","Não informada","Não Informada","NÃO",32113.01,3211.3,1605.65,0,0,27296.06,26702.03,2937.22,0,77,21885.08,2937.22,33652.629999999997,3365.26,1682.63,0,0,28604.74,27982.23,3078.04,0,22934.34,3078.04]
[null,44,19814,"0069417-12.2025.3.00.0000","2025-02-28","2025-08-01","MS 21.601/DF","2015-02-20","Administrativo - Servidor Público Civil - Sistema Remuneratório e Benefícios (PRINCIPAL)","2017-06-27","União","Ministério do Planejamento, Orçamento e Gestão","Incorporação de gratificação de apoio - GCEPLAC - Lei 12.702/12","Dedução de Honorários Contratuais","Alimentar","Não","Não","Não","-","-","Não informada","Não Informada","NÃO",104.09,10.4,5.2,0,0,88.49,0,0,0,0,0,0,109.08,10.9,5.45,0,0,92.73,0,0,0,0,0]
[null,45,19815,"0069420-64.2025.3.00.0000","2025-02-28","2025-08-01","MS 21.601/DF","2015-02-20","Administrativo - Servidor Público Civil - Sistema Remuneratório e Benefícios (PRINCIPAL)","2017-06-27","União","Ministério do Planejamento, Orçamento e Gestão","Incorporação de gratificação de apoio - GCEPLAC - Lei 12.702/12","Dedução de Honorários Contratuais","Alimentar","Não","Não","Não","-","-","Não informada","Não Informada","NÃO",54395.65,5439.56,2719.78,0,0,46236.31,45217.41,4973.91,0,77,37058.07,4973.91,57003.6,5700.36,2850.18,0,0,48453.06,47385.32,5212.38,0,38834.78,5212.38]
[null,46,19816,"0069442-25.2025.3.00.0000","2025-02-28","2025-08-01","MS 21.601/DF","2015-02-20","Administrativo - Servidor Público Civil - Sistema Remuneratório e Benefícios (PRINCIPAL)","2017-06-27","União","Ministério do Planejamento, Orçamento e Gestão","Incorporação de gratificação de apoio - GCEPLAC - Lei 12.702/12","Dedução de Honorários Contratuais","Alimentar","Não","Não","Não","-","-","Não informada","Não Informada","NÃO",29489.360000000001,2948.93,1474.46,0,0,25065.97,24172.799999999999,2659,0,59,19749.41,2659,30903.19,3090.31,1545.15,0,0,26267.73,25331.74,2786.49,0,20696.28,2786.49]
[null,47,19817,"0069448-32.2025.3.00.0000","2025-02-28","2025-08-01","MS 21.601/DF","2015-02-20","Administrativo - Servidor Público Civil - Sistema Remuneratório e Benefícios (PRINCIPAL)","2017-06-27","União","Ministério do Planejamento, Orçamento e Gestão","Incorporação de gratificação de apoio - GCEPLAC - Lei 12.702/12","Dedução de Honorários Contratuais","Alimentar","Não","Não","Não","-","-","Não informada","Não Informada","NÃO",32995.19,3299.51,1649.75,0,0,28045.93,1818.25,200,0,77,21752.77,200,34577.1,3457.71,1728.85,0,0,29390.54,1936.98,213.06,0,22795.67,213.06]
[null,48,19818,"0069467-38.2025.3.00.0000","2025-02-28","2025-08-01","MS 21.601/DF","2015-02-20","Administrativo - Servidor Público Civil - Sistema Remuneratório e Benefícios (PRINCIPAL)","2017-06-27","União","Ministério do Planejamento, Orçamento e Gestão","Incorporação de gratificação de apoio - GCEPLAC - Lei 12.702/12","Dedução de Honorários Contratuais","Alimentar","Não","Não","Não","-","-","Não informada","Não Informada","NÃO",11925.47,1192.54,596.27,0,0,10136.66,0,0,0,77,7860.78,0,12497.22,1249.72,624.86,0,0,10622.64,0,0,0,8237.65,0]
[null,49,19819,"0069469-08.2025.3.00.0000","2025-02-28","2025-08-01","MS 21.601/DF","2015-02-20","Administrativo - Servidor Público Civil - Sistema Remuneratório e Benefícios (PRINCIPAL)","2017-06-27","União","Ministério do Planejamento, Orçamento e Gestão","Incorporação de gratificação de apoio - GCEPLAC - Lei 12.702/12","Dedução de Honorários Contratuais","Alimentar","Não","Não","Não","-","-","Não informada","Não Informada","NÃO",54395.65,5439.56,2719.78,0,0,46236.31,45217.41,4973.91,0,77,37058.07,4973.91,57003.6,5700.36,2850.18,0,0,48453.06,47385.32,5212.38,0,38834.78,5212.38]
[null,50,19820,"0069470-90.2025.3.00.0000","2025-02-28","2025-08-01","MS 21.601/DF","2015-02-20","Administrativo - Servidor Público Civil - Sistema Remuneratório e Benefícios (PRINCIPAL)","2017-06-27","União","Ministério do Planejamento, Orçamento e Gestão","Incorporação de gratificação de apoio - GCEPLAC - Lei 12.702/12","Dedução de Honorários Contratuais","Alimentar","Não","Não","Não","-","-","Não informada","Não Informada","NÃO",28479.21,2847.92,1423.96,0,0,24207.33,1818.25,200,0,77,18900.97,200,29844.61,2984.46,1492.23,0,0,25367.919999999998,1936.98,213.06,0,19807.16,213.06]
[null,51,19821,"0069473-45.2025.3.00.0000","2025-02-28","2025-08-01","MS 21.601/DF","2015-02-20","Administrativo - Servidor Público Civil - Sistema Remuneratório e Benefícios (PRINCIPAL)","2017-06-27","União","Ministério do Planejamento, Orçamento e Gestão","Incorporação de gratificação de apoio - GCEPLAC - Lei 12.702/12","Dedução de Honorários Contratuais","Alimentar","Não","Não","Não","-","-","Não informada","Não Informada","NÃO",10197.06,1529.55,0,0,0,8667.51,0,0,0,35,6459.15,0,10685.94,1602.89,0,0,0,9083.0499999999993,0,0,0,6768.82,0]
[null,52,19822,"0069475-15.2025.3.00.0000","2025-02-28","2025-08-01","MS 21.601/DF","2015-02-20","Administrativo - Servidor Público Civil - Sistema Remuneratório e Benefícios (PRINCIPAL)","2017-06-27","União","Ministério do Planejamento, Orçamento e Gestão","Incorporação de gratificação de apoio - GCEPLAC - Lei 12.702/12","Dedução de Honorários Contratuais","Alimentar","Não","Não","Não","-","-","Não informada","Não Informada","NÃO",32997.19,3299.71,1649.85,0,0,28047.63,0,0,0,77,21752.47,0,34579.199999999997,3457.92,1728.96,0,0,29392.32,0,0,0,22795.35,0]
[null,53,19832,"0073448-75.2025.3.00.0000","2025-03-06","2025-08-01","MS 6.019/DF","1998-10-22","Administrativo - Servidor Público Civil - Sistema Remuneratório e Benefícios","2007-12-10","Instituto Nacional do Seguro Social – INSS","Instituto Nacional do Seguro Social - INSS","Reajuste Salarial - Resíduo de 3,17%","Dedução de Honorários Contratuais","Alimentar","Não","Não","Não","-","-","Não informada","Não Informada","NÃO",53208.41,3458.54,0,0,0,49749.87,24187.75,2660.65,0,43,20729.22,2660.65,55759.44,3624.36,0,0,0,52135.08,25767.21,2834.39,0,21723.06,2834.39]
[null,54,19839,"0077853-57.2025.3.00.0000","2025-03-10","2025-08-01","MS 4.151/DF","1995-07-21","Administrativo - Servidor Público Civil - Reajustes de Remuneração, Proventos ou Pensão","1999-02-12","União","Ministério da Fazenda","Diferença de remuneração - 3,17%","Dedução de Honorários Contratuais","Alimentar","Não","Não","Não","-","-","Não informada","Não Informada","NÃO",87674.1,5260.44,876.74,876.74,0,80660.179999999993,37878.89,4166.67,8333.34,53,25349.99,4166.67,91214.54,5472.87,912.14,912.14,0,83917.39,39977.379999999997,4397.51,8795.02,26373.67,4397.51]
[null,55,19840,"0077859-64.2025.3.00.0000","2025-03-10","2025-08-01","MS 4.151/DF","1995-07-21","Administrativo - Servidor Público Civil - Reajustes de Remuneração, Proventos ou Pensão","1999-02-12","União","Ministério da Fazenda","Diferença de remuneração - 3,17%","Dedução de Honorários Contratuais","Alimentar","Não","Não","Não","-","-","Não informada","Não Informada","NÃO",77845.58,4670.7299999999996,5449.19,5449.19,0,62276.47,0,0,0,53,10888.87,0,80989.13,4859.34,5669.23,5669.23,0,64791.33,0,0,0,11328.6,0]
[null,56,19843,"0078188-76.2025.3.00.0000","2025-03-10","2025-08-01","MS 6.019/DF","1998-10-22","Administrativo - Servidor Público Civil - Sistema Remuneratório e Benefícios","2007-12-10","Instituto Nacional do Seguro Social – INSS","Instituto Nacional do Seguro Social - INSS","Reajuste Salarial - Resíduo de 3,17%","x.x.x","Alimentar","Não","Não","Não","-","-","Não informada","Não Informada","NÃO",29741.56,0,0,0,0,29741.56,0,0,0,43,13368.51,0,31167.49,0,0,0,0,31167.49,0,0,0,14009.45,0]
[null,57,19844,"0078189-61.2025.3.00.0000","2025-03-10","2025-08-01","MS 6.019/DF","1998-10-22","Administrativo - Servidor Público Civil - Sistema Remuneratório e Benefícios","2007-12-10","Instituto Nacional do Seguro Social – INSS","Instituto Nacional do Seguro Social - INSS","Reajuste Salarial - Resíduo de 3,17%","Dedução de Honorários Contratuais","Alimentar","Não","Não","Não","-","-","Não informada","Não Informada","NÃO",35290.089999999997,2293.85,0,0,0,32996.239999999998,0,0,0,43,13644.65,0,36982.03,2403.83,0,0,0,34578.199999999997,0,0,0,14298.82,0]
[null,58,19845,"0078195-68.2025.3.00.0000","2025-03-10","2025-08-01","MS 6.019/DF","1998-10-22","Administrativo - Servidor Público Civil - Sistema Remuneratório e Benefícios","2007-12-10","Instituto Nacional do Seguro Social – INSS","Instituto Nacional do Seguro Social - INSS","Reajuste Salarial - Resíduo de 3,17%","Dedução de Honorários Contratuais","Alimentar","Não","Não","Não","-","-","Não informada","Não Informada","NÃO",41995.5,2729.7,0,0,0,39265.800000000003,0,0,0,43,15775.76,0,44008.93,2860.58,0,0,0,41148.35,0,0,0,16532.099999999999,0]
[null,59,19846,"0078206-97.2025.3.00.0000","2025-03-10","2025-08-01","MS 6.019/DF","1998-10-22","Administrativo - Servidor Público Civil - Sistema Remuneratório e Benefícios","2007-12-10","Instituto Nacional do Seguro Social – INSS","Instituto Nacional do Seguro Social - INSS","Reajuste Salarial - Resíduo de 3,17%","Dedução de Honorários Contratuais","Alimentar","Não","Não","Não","-","-","Não informada","Não Informada","NÃO",59861.25,3890.98,0,0,0,55970.27,0,0,0,43,23072.01,0,62731.24,4077.53,0,0,0,58653.71,0,0,0,24178.17,0]
[null,60,19847,"0078208-67.2025.3.00.0000","2025-03-10","2025-08-01","MS 6.019/DF","1998-10-22","Administrativo - Servidor Público Civil - Sistema Remuneratório e Benefícios","2007-12-10","Instituto Nacional do Seguro Social – INSS","Instituto Nacional do Seguro Social - INSS","Reajuste Salarial - Resíduo de 3,17%","Dedução de Honorários Contratuais","Alimentar","Não","Não","Não","-","-","Não informada","Não Informada","NÃO",22923.62,1490.03,0,0,0,21433.59,0,0,0,43,8607.18,0,24022.67,1561.47,0,0,0,22461.200000000001,0,0,0,9019.84,0]
[null,61,19848,"0078220-81.2025.3.00.0000","2025-03-10","2025-08-01","MS 6.019/DF","1998-10-22","Administrativo - Servidor Público Civil - Sistema Remuneratório e Benefícios","2007-12-10","Instituto Nacional do Seguro Social – INSS","Instituto Nacional do Seguro Social - INSS","Reajuste Salarial - Resíduo de 3,17%","Dedução de Honorários Contratuais","Alimentar","Não","Não","Não","-","-","Não informada","Não Informada","NÃO",12403.81,806.24,0,0,0,11597.57,0,0,0,43,4682.87,0,12998.5,844.9,0,0,0,12153.6,0,0,0,4907.38,0]
[null,62,19849,"0078222-51.2025.3.00.0000","2025-03-10","2025-08-01","MS 6.019/DF","1998-10-22","Administrativo - Servidor Público Civil - Sistema Remuneratório e Benefícios","2007-12-10","Instituto Nacional do Seguro Social – INSS","Instituto Nacional do Seguro Social - INSS","Reajuste Salarial - Resíduo de 3,17%","Dedução de Honorários Contratuais","Alimentar","Não","Não","Não","-","-","Não informada","Não Informada","NÃO",33200.42,2158.02,0,0,0,31042.400000000001,0,0,0,43,12544.23,0,34792.18,2261.4899999999998,0,0,0,32530.69,0,0,0,13145.64,0]
[null,63,19850,"0078591-45.2025.3.00.0000","2025-03-10","2025-08-01","MS 6.019/DF","1998-10-22","Administrativo - Servidor Público Civil - Sistema Remuneratório e Benefícios","2007-12-10","Instituto Nacional do Seguro Social – INSS","Instituto Nacional do Seguro Social - INSS","Reajuste Salarial - Resíduo de 3,17%","Dedução de Honorários Contratuais","Alimentar","Não","Não","Não","-","-","Não informada","Não Informada","NÃO",45478.32,2956.09,0,0,0,42522.23,0,0,0,43,17552.93,0,47658.73,3097.81,0,0,0,44560.92,0,0,0,18394.490000000002,0]
[null,64,19851,"0078595-82.2025.3.00.0000","2025-03-10","2025-08-01","MS 6.019/DF","1998-10-22","Administrativo - Servidor Público Civil - Sistema Remuneratório e Benefícios","2007-12-10","Instituto Nacional do Seguro Social – INSS","Instituto Nacional do Seguro Social - INSS","Reajuste Salarial - Resíduo de 3,17%","Dedução de Honorários Contratuais","Alimentar","Não","Não","Não","-","-","Não informada","Não Informada","NÃO",43542.79,2830.28,0,0,0,40712.51,0,0,0,43,16471.93,0,45630.400000000001,2965.97,0,0,0,42664.43,0,0,0,17261.66,0]
[null,65,19852,"0078623-50.2025.3.00.0000","2025-03-10","2025-08-01","MS 6.019/DF","1998-10-22","Administrativo - Servidor Público Civil - Sistema Remuneratório e Benefícios","2007-12-10","Instituto Nacional do Seguro Social – INSS","Instituto Nacional do Seguro Social - INSS","Reajuste Salarial - Resíduo de 3,17%","Dedução de Honorários Contratuais","Alimentar","Não","Não","Não","-","-","Não informada","Não Informada","NÃO",68433.75,4448.1899999999996,0,0,0,63985.56,0,0,0,43,25866.05,0,71714.740000000005,4661.45,0,0,0,67053.289999999994,0,0,0,27106.18,0]
[null,66,19853,"0078624-35.2025.3.00.0000","2025-03-10","2025-08-01","MS 6.019/DF","1998-10-22","Administrativo - Servidor Público Civil - Sistema Remuneratório e Benefícios","2007-12-10","Instituto Nacional do Seguro Social – INSS","Instituto Nacional do Seguro Social - INSS","Reajuste Salarial - Resíduo de 3,17%","Dedução de Honorários Contratuais","Alimentar","Não","Não","Não","-","-","Não informada","Não Informada","NÃO",53368.69,3468.96,0,0,0,49899.73,0,0,0,43,20154.509999999998,0,55927.4,3635.28,0,0,0,52292.12,0,0,0,21120.79,0]
[null,{"$f":"IF(C77=\"\",\"\",B76+1)","v":67},19854,"0078635-64.2025.3.00.0000","2025-03-10","2025-08-01","MS 6.019/DF","1998-10-22","Administrativo - Servidor Público Civil - Sistema Remuneratório e Benefícios","2007-12-10","Instituto Nacional do Seguro Social – INSS","Instituto Nacional do Seguro Social - INSS","Reajuste Salarial - Resíduo de 3,17%","Dedução de Honorários Contratuais","Alimentar","Não","Não","Não","-","-","Não informada","Não Informada","NÃO",32847.230000000003,2135.06,0,0,0,30712.17,0,0,0,43,12395.47,0,34422.050000000003,2237.4299999999998,0,0,0,32184.62,0,0,0,12989.75,0]
[null,68,19855,"0078638-19.2025.3.00.0000","2025-03-10","2025-08-01","MS 6.019/DF","1998-10-22","Administrativo - Servidor Público Civil - Sistema Remuneratório e Benefícios","2007-12-10","Instituto Nacional do Seguro Social – INSS","Instituto Nacional do Seguro Social - INSS","Reajuste Salarial - Resíduo de 3,17%","Dedução de Honorários Contratuais","Alimentar","Não","Não","Não","-","-","Não informada","Não Informada","NÃO",37219.71,2419.2800000000002,0,0,0,34800.43,0,0,0,43,14004.72,0,39004.17,2535.27,0,0,0,36468.9,0,0,0,14676.16,0]
[null,69,19856,"0078646-93.2025.3.00.0000","2025-03-10","2025-08-01","MS 6.019/DF","1998-10-22","Administrativo - Servidor Público Civil - Sistema Remuneratório e Benefícios","2007-12-10","Instituto Nacional do Seguro Social – INSS","Instituto Nacional do Seguro Social - INSS","Reajuste Salarial - Resíduo de 3,17%","Dedução de Honorários Contratuais","Alimentar","Não","Não","Não","-","-","Não informada","Não Informada","NÃO",66255.09,4306.58,0,0,0,61948.51,0,0,0,43,25528.92,0,69431.62,4513.05,0,0,0,64918.57,0,0,0,26752.880000000001,0]
[null,70,19891,"0098780-44.2025.3.00.0000","2025-03-21","2025-08-01","MS 10.438/DF","2005-02-22","Administrativo - Militar - Pensão","2007-09-13","União","Ministério da Fazenda","Soldo previsto na Lei Estadual 1.063/2002","Dedução de Honorários Contratuais","Alimentar","Não","Não","Não","-","-","Não informada","Não Informada","NÃO",33592.9,6886.54,3527.25,0,0,23179.11,0,0,0,46,12043.62,0,34949.440000000002,7164.63,3669.69,0,0,24115.119999999999,0,0,0,12529.96,0]
[null,71,19892,"0098810-79.2025.3.00.0000","2025-03-21","2025-08-01","MS 10.438/DF","2005-02-22","Administrativo - Militar - Pensão","2007-09-13","União","Ministério da Fazenda","Soldo previsto na Lei Estadual 1.063/2002","Dedução de Honorários Contratuais","Alimentar","Não","Não","Não","-","-","Não informada","Não Informada","NÃO",33592.9,6886.54,3527.25,0,0,23179.11,0,0,0,46,12043.62,0,34949.440000000002,7164.63,3669.69,0,0,24115.119999999999,0,0,0,12529.96,0]
[null,72,19893,"0098817-71.2025.3.00.0000","2025-03-21","2025-08-01","MS 10.438/DF","2005-02-22","Administrativo - Militar - Pensão","2007-09-13","União","Ministério da Fazenda","Soldo previsto na Lei Estadual 1.063/2002","Dedução de Honorários Contratuais","Alimentar","Não","Não","Não","-","-","Não informada","Não Informada","NÃO",33592.9,6886.54,3527.25,0,0,23179.11,0,0,0,46,12043.62,0,34949.440000000002,7164.63,3669.69,0,0,24115.119999999999,0,0,0,12529.96,0]
[null,73,19895,"0098847-09.2025.3.00.0000","2025-03-21","2025-08-01","MS 10.438/DF","2005-02-22","Administrativo - Militar - Pensão","2007-09-13","União","Ministério da Fazenda","Soldo previsto na Lei Estadual 1.063/2002","Dedução de Honorários Contratuais","Alimentar","Não","Não","Não","-","-","Não informada","Não Informada","NÃO",33592.9,6886.54,3527.25,0,0,23179.11,0,0,0,46,12043.62,0,34949.440000000002,7164.63,3669.69,0,0,24115.119999999999,0,0,0,12529.96,0]
[null,74,19897,"0098858-38.2025.3.00.0000","2025-03-21","2025-08-01","MS 10.438/DF","2005-02-22","Administrativo - Militar - Pensão","2007-09-13","União","Ministério da Fazenda","Soldo previsto na Lei Estadual 1.063/2002","Dedução de Honorários Contratuais","Alimentar","Não","Não","Não","-","-","Não informada","Não Informada","NÃO",33592.9,6886.54,3527.25,0,0,23179.11,0,0,0,46,12043.62,0,34949.440000000002,7164.63,3669.69,0,0,24115.119999999999,0,0,0,12529.96,0]
[null,75,19898,"0098878-29.2025.3.00.0000","2025-03-21","2025-08-01","MS 10.438/DF","2005-02-22","Administrativo - Militar - Pensão","2007-09-13","União","Ministério da Fazenda","Soldo previsto na Lei Estadual 1.063/2002","Dedução de Honorários Contratuais","Alimentar","Não","Não","Não","-","-","Não informada","Não Informada","NÃO",33592.9,6886.54,3527.25,0,0,23179.11,0,0,0,46,12043.62,0,34949.440000000002,7164.63,3669.69,0,0,24115.119999999999,0,0,0,12529.96,0]
[null,76,19900,"0098884-36.2025.3.00.0000","2025-03-21","2025-08-01","MS 21.601/DF","2015-02-20","Administrativo - Servidor Público Civil - Sistema Remuneratório e Benefícios (PRINCIPAL)","2017-06-27","União","Ministério do Planejamento, Orçamento e Gestão","Incorporação de gratificação de apoio - GCEPLAC - Lei 12.702/12","Dedução de Honorários Contratuais","Alimentar","Não","Não","Não","-","-","Não informada","Não Informada","NÃO",12502.78,1250.27,625.13,0,0,10627.38,164.73,18.12,0,75,8343.5400000000009,18.12,13007.66,1300.76,650.38,0,0,11056.52,173.85,19.12,0,8680.4599999999991,19.12]
[null,77,19901,"0098890-43.2025.3.00.0000","2025-03-21","2025-08-01","MS 21.601/DF","2015-02-20","Administrativo - Servidor Público Civil - Sistema Remuneratório e Benefícios (PRINCIPAL)","2017-06-27","União","Ministério do Planejamento, Orçamento e Gestão","Incorporação de gratificação de apoio - GCEPLAC - Lei 12.702/12","Dedução de Honorários Contratuais","Alimentar","Não","Não","Não","-","-","Não informada","Não Informada","NÃO",33982.21,3398.22,1699.11,0,0,28884.880000000001,28728.61,3160.14,0,75,23182.6,3160.14,35354.46,3535.44,1767.72,0,0,30051.3,30320.17,3335.21,0,24118.76,3335.21]
[null,78,19903,"0098893-95.2025.3.00.0000","2025-03-21","2025-08-01","MS 21.601/DF","2015-02-20","Administrativo - Servidor Público Civil - Sistema Remuneratório e Benefícios (PRINCIPAL)","2017-06-27","União","Ministério do Planejamento, Orçamento e Gestão","Incorporação de gratificação de apoio - GCEPLAC - Lei 12.702/12","Dedução de Honorários Contratuais","Alimentar","Não","Não","Não","-","-","Não informada","Não Informada","NÃO",34609.71,3460.97,1730.48,0,0,29418.26,0,0,0,75,23088.48,0,36007.300000000003,3600.73,1800.36,0,0,30606.21,0,0,0,24020.83,0]
[null,79,19904,"0098896-50.2025.3.00.0000","2025-03-21","2025-08-01","MS 21.601/DF","2015-02-20","Administrativo - Servidor Público Civil - Sistema Remuneratório e Benefícios (PRINCIPAL)","2017-06-27","União","Ministério do Planejamento, Orçamento e Gestão","Incorporação de gratificação de apoio - GCEPLAC - Lei 12.702/12","Dedução de Honorários Contratuais","Alimentar","Não","Não","Não","-","-","Não informada","Não Informada","NÃO",12506.26,1250.6199999999999,625.30999999999995,0,0,10630.33,56.24,6.18,0,75,8343.01,6.18,13011.28,1301.1199999999999,650.55999999999995,0,0,11059.6,59.35,6.52,0,8679.92,6.52]
[null,80,19906,"0098899-05.2025.3.00.0000","2025-03-21","2025-08-01","MS 21.601/DF","2015-02-20","Administrativo - Servidor Público Civil - Sistema Remuneratório e Benefícios (PRINCIPAL)","2017-06-27","União","Ministério do Planejamento, Orçamento e Gestão","Incorporação de gratificação de apoio - GCEPLAC - Lei 12.702/12","Dedução de Honorários Contratuais","Alimentar","Não","Não","Não","-","-","Não informada","Não Informada","NÃO",57569.01,5756.9,2878.45,0,0,48933.66,49082.05,5399.02,0,75,39261.19,5399.02,59893.75,5989.37,2994.68,0,0,50909.7,51801.19,5698.13,0,40846.639999999999,5698.13]
[null,81,19907,"0098922-48.2025.3.00.0000","2025-03-21","2025-08-01","MS 21.601/DF","2015-02-20","Administrativo - Servidor Público Civil - Sistema Remuneratório e Benefícios (PRINCIPAL)","2017-06-27","União","Ministério do Planejamento, Orçamento e Gestão","Incorporação de gratificação de apoio - GCEPLAC - Lei 12.702/12","Dedução de Honorários Contratuais","Alimentar","Não","Não","Não","-","-","Não informada","Não Informada","NÃO",2204,220.4,110.2,0,0,1873.4,0,0,0,15,1796.32,0,2292.9899999999998,229.29,114.64,0,0,1949.06,0,0,0,1868.87,0]
[null,82,19909,"0098928-55.2025.3.00.0000","2025-03-21","2025-08-01","MS 21.601/DF","2015-02-20","Administrativo - Servidor Público Civil - Sistema Remuneratório e Benefícios (PRINCIPAL)","2017-06-27","União","Ministério do Planejamento, Orçamento e Gestão","Incorporação de gratificação de apoio - GCEPLAC - Lei 12.702/12","Dedução de Honorários Contratuais","Alimentar","Não","Não","Não","-","-","Não informada","Não Informada","NÃO",33982.21,3398.22,1699.11,0,0,28884.880000000001,28728.61,3160.14,0,75,23182.6,3160.14,35354.46,3535.44,1767.72,0,0,30051.3,30320.17,3335.21,0,24118.76,3335.21]
[null,83,19910,"0098930-25.2025.3.00.0000","2025-03-21","2025-08-01","MS 21.601/DF","2015-02-20","Administrativo - Servidor Público Civil - Sistema Remuneratório e Benefícios (PRINCIPAL)","2017-06-27","União","Ministério do Planejamento, Orçamento e Gestão","Incorporação de gratificação de apoio - GCEPLAC - Lei 12.702/12","Dedução de Honorários Contratuais","Alimentar","Não","Não","Não","-","-","Não informada","Não Informada","NÃO",150.34,15.03,7.51,0,0,127.8,0,0,0,2,124.46,0,156.4,15.64,7.82,0,0,132.94,0,0,0,129.47,0]
[null,84,19912,"0098933-77.2025.3.00.0000","2025-03-21","2025-08-01","MS 21.601/DF","2015-02-20","Administrativo - Servidor Público Civil - Sistema Remuneratório e Benefícios (PRINCIPAL)","2017-06-27","União","Ministério do Planejamento, Orçamento e Gestão","Incorporação de gratificação de apoio - GCEPLAC - Lei 12.702/12","Dedução de Honorários Contratuais","Alimentar","Não","Não","Não","-","-","Não informada","Não Informada","NÃO",33982.21,3398.22,1699.11,0,0,28884.880000000001,28728.61,3160.14,0,75,23182.6,3160.14,35354.46,3535.44,1767.72,0,0,30051.3,30320.17,3335.21,0,24118.76,3335.21]
[null,85,19913,"0098938-02.2025.3.00.0000","2025-03-21","2025-08-01","MS 21.601/DF","2015-02-20","Administrativo - Servidor Público Civil - Sistema Remuneratório e Benefícios (PRINCIPAL)","2017-06-27","União","Ministério do Planejamento, Orçamento e Gestão","Incorporação de gratificação de apoio - GCEPLAC - Lei 12.702/12","Dedução de Honorários Contratuais","Alimentar","Não","Não","Não","-","-","Não informada","Não Informada","NÃO",57568.5,5756.85,2878.42,0,0,48933.23,49620.92,5458.3,0,75,39261.269999999997,5458.3,59893.22,5989.32,2994.66,0,0,50909.24,52369.91,5760.69,0,40846.71,5760.69]
[null,86,19915,"0098967-52.2025.3.00.0000","2025-03-21","2025-08-01","MS 21.601/DF","2015-02-20","Administrativo - Servidor Público Civil - Sistema Remuneratório e Benefícios (PRINCIPAL)","2017-06-27","União","Ministério do Planejamento, Orçamento e Gestão","Incorporação de gratificação de apoio - GCEPLAC - Lei 12.702/12","Dedução de Honorários Contratuais","Alimentar","Não","Não","Não","-","-","Não informada","Não Informada","NÃO",33982.21,3398.22,1699.11,0,0,28884.880000000001,28728.61,3160.14,0,75,23182.6,3160.14,35354.46,3535.44,1767.72,0,0,30051.3,30320.17,3335.21,0,24118.76,3335.21]
[null,87,19916,"0098979-66.2025.3.00.0000","2025-03-21","2025-08-01","MS 21.601/DF","2015-02-20","Administrativo - Servidor Público Civil - Sistema Remuneratório e Benefícios (PRINCIPAL)","2017-06-27","União","Ministério do Planejamento, Orçamento e Gestão","Incorporação de gratificação de apoio - GCEPLAC - Lei 12.702/12","Dedução de Honorários Contratuais","Alimentar","Não","Não","Não","-","-","Não informada","Não Informada","NÃO",33982.21,3398.22,1699.11,0,0,28884.880000000001,28728.61,3160.14,0,75,23182.6,3160.14,35354.46,3535.44,1767.72,0,0,30051.3,30320.17,3335.21,0,24118.76,3335.21]
[null,88,19917,"0098981-36.2025.3.00.0000","2025-03-21","2025-08-01","MS 21.601/DF","2015-02-20","Administrativo - Servidor Público Civil - Sistema Remuneratório e Benefícios (PRINCIPAL)","2017-06-27","União","Ministério do Planejamento, Orçamento e Gestão","Incorporação de gratificação de apoio - GCEPLAC - Lei 12.702/12","Dedução de Honorários Contratuais","Alimentar","Não","Não","Não","-","-","Não informada","Não Informada","NÃO",33982.21,3398.22,1699.11,0,0,28884.880000000001,28728.61,3160.14,0,75,23182.6,3160.14,35354.46,3535.44,1767.72,0,0,30051.3,30320.17,3335.21,0,24118.76,3335.21]
[null,89,19918,"0098984-88.2025.3.00.0000","2025-03-21","2025-08-01","MS 21.601/DF","2015-02-20","Administrativo - Servidor Público Civil - Sistema Remuneratório e Benefícios (PRINCIPAL)","2017-06-27","União","Ministério do Planejamento, Orçamento e Gestão","Incorporação de gratificação de apoio - GCEPLAC - Lei 12.702/12","Dedução de Honorários Contratuais","Alimentar","Não","Não","Não","-","-","Não informada","Não Informada","NÃO",34609.71,3460.97,1730.48,0,0,29418.26,0,0,0,75,23088.48,0,36007.300000000003,3600.73,1800.36,0,0,30606.21,0,0,0,24020.83,0]
[null,90,19919,"0098986-58.2025.3.00.0000","2025-03-21","2025-08-01","MS 21.601/DF","2015-02-20","Administrativo - Servidor Público Civil - Sistema Remuneratório e Benefícios (PRINCIPAL)","2017-06-27","União","Ministério do Planejamento, Orçamento e Gestão","Incorporação de gratificação de apoio - GCEPLAC - Lei 12.702/12","Dedução de Honorários Contratuais","Alimentar","Não","Não","Não","-","-","Não informada","Não Informada","NÃO",33982.21,3398.22,1699.11,0,0,28884.880000000001,28728.61,3160.14,0,75,23182.6,3160.14,35354.46,3535.44,1767.72,0,0,30051.3,30320.17,3335.21,0,24118.76,3335.21]
[null,91,19920,"0098999-57.2025.3.00.0000","2025-03-21","2025-08-01","MS 21.601/DF","2015-02-20","Administrativo - Servidor Público Civil - Sistema Remuneratório e Benefícios (PRINCIPAL)","2017-06-27","União","Ministério do Planejamento, Orçamento e Gestão","Incorporação de gratificação de apoio - GCEPLAC - Lei 12.702/12","Dedução de Honorários Contratuais","Alimentar","Não","Não","Não","-","-","Não informada","Não Informada","NÃO",57568.5,5756.85,2878.42,0,0,48933.23,49620.92,5458.3,0,75,39261.269999999997,5458.3,59893.22,5989.32,2994.66,0,0,50909.24,52369.91,5760.69,0,40846.71,5760.69]
[null,92,19921,"0099000-42.2025.3.00.0000","2025-03-21","2025-08-01","MS 21.601/DF","2015-02-20","Administrativo - Servidor Público Civil - Sistema Remuneratório e Benefícios (PRINCIPAL)","2017-06-27","União","Ministério do Planejamento, Orçamento e Gestão","Incorporação de gratificação de apoio - GCEPLAC - Lei 12.702/12","Dedução de Honorários Contratuais","Alimentar","Não","Não","Não","-","-","Não informada","Não Informada","NÃO",12507.09,1250.7,625.35,0,0,10631.04,0,0,0,75,8342.89,0,13012.14,1301.21,650.6,0,0,11060.33,0,0,0,8679.7900000000009,0]
[null,93,19923,"0099016-93.2025.3.00.0000","2025-03-21","2025-08-01","MS 21.601/DF","2015-02-20","Administrativo - Servidor Público Civil - Sistema Remuneratório e Benefícios (PRINCIPAL)","2017-06-27","União","Ministério do Planejamento, Orçamento e Gestão","Incorporação de gratificação de apoio - GCEPLAC - Lei 12.702/12","Dedução de Honorários Contratuais","Alimentar","Não","Não","Não","-","-","Não informada","Não Informada","NÃO",57568.5,5756.85,2878.42,0,0,48933.23,49620.92,5458.3,0,75,39261.269999999997,5458.3,59893.22,5989.32,2994.66,0,0,50909.24,52369.91,5760.69,0,40846.71,5760.69]
[null,94,19925,"0099046-31.2025.3.00.0000","2025-03-21","2025-08-01","MS 21.601/DF","2015-02-20","Administrativo - Servidor Público Civil - Sistema Remuneratório e Benefícios (PRINCIPAL)","2017-06-27","União","Ministério do Planejamento, Orçamento e Gestão","Incorporação de gratificação de apoio - GCEPLAC - Lei 12.702/12","Dedução de Honorários Contratuais","Alimentar","Não","Não","Não","-","-","Não informada","Não Informada","NÃO",55028.41,5502.84,2751.42,0,0,46774.15,46930.05,5162.3,0,75,37536.74,5162.3,57250.559999999998,5725.05,2862.52,0,0,48662.99,49529.97,5448.29,0,39052.559999999998,5448.29]
[null,95,19926,"0099052-38.2025.3.00.0000","2025-03-21","2025-08-01","MS 21.601/DF","2015-02-20","Administrativo - Servidor Público Civil - Sistema Remuneratório e Benefícios (PRINCIPAL)","2017-06-27","União","Ministério do Planejamento, Orçamento e Gestão","Incorporação de gratificação de apoio - GCEPLAC - Lei 12.702/12","Dedução de Honorários Contratuais","Alimentar","Não","Não","Não","-","-","Não informada","Não Informada","NÃO",38901.11,3890.11,1945.05,0,0,33065.949999999997,0,0,0,75,28445.67,0,40472,4047.2,2023.6,0,0,34401.199999999997,0,0,0,29594.35,0]
[null,96,19927,"0099060-15.2025.3.00.0000","2025-03-21","2025-08-01","MS 21.601/DF","2015-02-20","Administrativo - Servidor Público Civil - Sistema Remuneratório e Benefícios (PRINCIPAL)","2017-06-27","União","Ministério do Planejamento, Orçamento e Gestão","Incorporação de gratificação de apoio - GCEPLAC - Lei 12.702/12","Dedução de Honorários Contratuais","Alimentar","Não","Não","Não","-","-","Não informada","Não Informada","NÃO",57299.33,5729.93,2864.96,0,0,48704.44,49372.1,5430.93,0,75,39052.959999999999,5430.93,59613.18,5961.31,2980.65,0,0,50671.22,52107.31,5731.8,0,40630,5731.8]
[null,97,19934,"0099195-27.2025.3.00.0000","2025-03-21","2025-08-01","MS 4.151/DF","1995-07-21","Administrativo - Servidor Público Civil - Reajustes de Remuneração, Proventos ou Pensão","1999-02-12","União","Ministério da Fazenda","Diferença de remuneração - 3,17%","Dedução de Honorários Contratuais","Alimentar","Não","Não","Não","-","-","Não informada","Não Informada","NÃO",79652.94,6372.23,796.52,796.52,0,71687.67,37903.75,4169.41,8338.82,53,20197.52,4169.41,82869.47,6629.55,828.69,828.69,0,74582.539999999994,40003.61,4400.3900000000003,8800.7800000000007,21013.119999999999,4400.3900000000003]
[null,98,19937,"0099255-97.2025.3.00.0000","2025-03-21","2025-08-01","MS 4.151/DF","1995-07-21","Administrativo - Servidor Público Civil - Reajustes de Remuneração, Proventos ou Pensão","1999-02-12","União","Ministério da Fazenda","Diferença de remuneração - 3,17%","Dedução de Honorários Contratuais","Alimentar","Não","Não","Não","-","-","Não informada","Não Informada","NÃO",78812.259999999995,4728.7299999999996,788.12,788.12,0,72507.289999999994,18871.810000000001,2075.89,4151.78,53,21148.71,2075.89,81994.84,4919.6899999999996,819.94,819.94,0,75435.27,19917.3,2190.9,4381.8,22002.74,2190.9]
[null,99,19938,"0099258-52.2025.3.00.0000","2025-03-21","2025-08-01","MS 4.151/DF","1995-07-21","Administrativo - Servidor Público Civil - Reajustes de Remuneração, Proventos ou Pensão","1999-02-12","União","Ministério da Fazenda","Diferença de remuneração - 3,17%","Dedução de Honorários Contratuais","Alimentar","Não","Não","Não","-","-","Não informada","Não Informada","NÃO",89373.47,7149.87,893.73,893.73,0,80436.14,0,0,0,53,24014.69,0,92982.53,7438.6,929.82,929.82,0,83684.289999999994,0,0,0,24984.44,0]
[null,100,19939,"0099292-27.2025.3.00.0000","2025-03-21","2025-08-01","MS 4.151/DF","1995-07-21","Administrativo - Servidor Público Civil - Reajustes de Remuneração, Proventos ou Pensão","1999-02-12","União","Ministério da Fazenda","Diferença de remuneração - 3,17%","Dedução de Honorários Contratuais","Alimentar","Não","Não","Não","-","-","Não informada","Não Informada","NÃO",78070.929999999993,4684.25,780.7,780.7,0,71825.279999999999,0,0,0,53,22671.1,0,81223.58,4873.41,812.23,812.23,0,74725.710000000006,0,0,0,23586.59,0]
[null,101,19940,"0099299-19.2025.3.00.0000","2025-03-21","2025-08-01","MS 4.151/DF","1995-07-21","Administrativo - Servidor Público Civil - Reajustes de Remuneração, Proventos ou Pensão","1999-02-12","União","Ministério da Fazenda","Diferença de remuneração - 3,17%","Dedução de Honorários Contratuais","Alimentar","Não","Não","Não","-","-","Não informada","Não Informada","NÃO",86959.93,6956.79,869.59,869.59,0,78263.960000000006,40434.239999999998,4447.76,8895.52,53,22445.61,4447.76,90471.53,7237.72,904.71,904.71,0,81424.39,42674.29,4694.17,9388.34,23351.99,4694.17]
[null,102,19962,"0100322-97.2025.3.00.0000","2025-03-24","2025-08-01","MS 26.382/DF","2020-06-17","Administrativo - Militar - Regime - Anistia Política","2022-02-16","União","Ministério da Mulher, da Família e dos Direitos Humanos","Anistia Política - Reparação Econômica","Dedução de Honorários Contratuais","Comum","Não","Não","Não","-","-","Não informada","Não Informada","SIM",1340.95,335.23,0,0,0,1005.72,0,0,0,0,0,0,1395.28,348.82,0,0,0,1046.46,0,0,0,0,0]
[null,103,19963,"0100327-22.2025.3.00.0000","2025-03-24","2025-08-01","MS 26.382/DF","2020-06-17","Administrativo - Militar - Regime - Anistia Política","2022-02-16","União","-","Honorários de sucumbência","x.x.x","Alimentar","Não","Não","Não","-","-","Não informada","Não Informada","NÃO",126.09,0,0,0,0,126.09,0,0,0,0,0,0,131.26,0,0,0,0,131.26,0,0,0,0,0]
[null,104,19965,"0101698-21.2025.3.00.0000","2025-03-24","2025-08-01","MS 4.151/DF","1995-07-21","Administrativo - Servidor Público Civil - Reajustes de Remuneração, Proventos ou Pensão","1999-02-12","União","Ministério da Fazenda","Diferença de remuneração - 3,17%","Dedução de Honorários Contratuais","Alimentar","Não","Não","Não","-","-","Não informada","Não Informada","NÃO",63925.25,3835.51,639.25,639.25,0,58811.24,41384.33,4552.2700000000004,9104.5400000000009,53,12003.94,4552.2700000000004,66506.67,3990.4,665.06,665.06,0,61186.15,43677.02,4804.47,9608.94,12488.68,4804.47]
[null,105,19971,"0105510-71.2025.3.00.0000","2025-03-26","2025-08-01","MS 4.151/DF","1995-07-21","Administrativo - Servidor Público Civil - Reajustes de Remuneração, Proventos ou Pensão","1999-02-12","União","Ministério da Fazenda","Diferença de remuneração - 3,17%","Dedução de Honorários Contratuais","Alimentar","Não","Não","Não","-","-","Não informada","Não Informada","NÃO",87724.63,5263.47,877.24,877.24,0,80706.679999999993,0,0,0,53,25210.959999999999,0,91267.11,5476.02,912.67,912.67,0,83965.75,0,0,0,26229.01,0]
[null,106,19972,"0105517-63.2025.3.00.0000","2025-03-26","2025-08-01","MS 3.099/DF","1993-09-15","Administrativo - Servidor Público Civil - Reajustes de Remuneração, Proventos ou Pensão - Índice de 28,86% Lei 8.622/1993 e 8.627/1993","2000-06-07","União","Ministério da Saúde","Índice de 28,86% Lei 8.622/1993 e 8.627/1993","Dedução de Honorários Contratuais","Alimentar","Não","Não","Não","-","-","Não informada","Não Informada","NÃO",4735.3999999999996,473.54,0,0,0,4261.8599999999997,1633.37,179.67,359.34,63,1159.83,179.67,4926.6099999999997,492.66,0,0,0,4433.95,1699.32,186.92,373.84,1206.6600000000001,186.92]
[null,107,19973,"0105519-33.2025.3.00.0000","2025-03-26","2025-08-01","MS 3.099/DF","1993-09-15","Administrativo - Servidor Público Civil - Reajustes de Remuneração, Proventos ou Pensão - Índice de 28,86% Lei 8.622/1993 e 8.627/1993","2000-06-07","União","Ministério da Saúde","Índice de 28,86% Lei 8.622/1993 e 8.627/1993","Dedução de Honorários Contratuais","Alimentar","Não","Não","Não","-","-","Não informada","Não Informada","NÃO",1510.41,151.04,0,0,0,1359.37,542.64,59.69,119.38,47,391.6,59.69,1571.4,157.13999999999999,0,0,0,1414.26,564.54999999999995,62.1,124.2,407.41,62.1]
[null,108,19974,"0105545-31.2025.3.00.0000","2025-03-26","2025-08-01","MS 3.099/DF","1993-09-15","Administrativo - Servidor Público Civil - Reajustes de Remuneração, Proventos ou Pensão - Índice de 28,86% Lei 8.622/1993 e 8.627/1993","2000-06-07","União","Ministério da Saúde","Índice de 28,86% Lei 8.622/1993 e 8.627/1993","Dedução de Honorários Contratuais","Alimentar","Não","Não","Não","-","-","Não informada","Não Informada","NÃO",3327.3,332.73,0,0,0,2994.57,1156.31,127.19,254.38,63,823.58,127.19,3461.65,346.16,0,0,0,3115.49,1203,132.33000000000001,264.66000000000003,856.84,132.33000000000001]
[null,109,19975,"0105550-53.2025.3.00.0000","2025-03-26","2025-08-01","MS 3.099/DF","1993-09-15","Administrativo - Servidor Público Civil - Reajustes de Remuneração, Proventos ou Pensão - Índice de 28,86% Lei 8.622/1993 e 8.627/1993","2000-06-07","União","Ministério da Saúde","Índice de 28,86% Lei 8.622/1993 e 8.627/1993","Dedução de Honorários Contratuais","Alimentar","Não","Não","Não","-","-","Não informada","Não Informada","NÃO",1714.42,171.44,0,0,0,1542.98,0,0,0,63,399.79,0,1783.64,178.36,0,0,0,1605.28,0,0,0,415.93,0]
[null,110,19976,"0105553-08.2025.3.00.0000","2025-03-26","2025-08-01","MS 3.099/DF","1993-09-15","Administrativo - Servidor Público Civil - Reajustes de Remuneração, Proventos ou Pensão - Índice de 28,86% Lei 8.622/1993 e 8.627/1993","2000-06-07","União","Ministério da Saúde","Índice de 28,86% Lei 8.622/1993 e 8.627/1993","x.x.x","Alimentar","Não","Não","Não","-","-","Não informada","Não Informada","NÃO",1268.8699999999999,0,0,0,0,1268.8699999999999,427.15,46.98,93.96,63,427.15,46.98,1320.1,0,0,0,0,1320.1,444.39,48.88,97.76,444.39,48.88]
[null,111,19977,"0105554-90.2025.3.00.0000","2025-03-26","2025-08-01","MS 3.099/DF","1993-09-15","Administrativo - Servidor Público Civil - Reajustes de Remuneração, Proventos ou Pensão - Índice de 28,86% Lei 8.622/1993 e 8.627/1993","2000-06-07","União","Ministério da Saúde","Índice de 28,86% Lei 8.622/1993 e 8.627/1993","Dedução de Honorários Contratuais","Alimentar","Não","Não","Não","-","-","Não informada","Não Informada","NÃO",413.02,41.3,0,0,0,371.72,0,0,0,63,0,0,429.69,42.96,0,0,0,386.73,0,0,0,0,0]
[null,112,19978,"0105585-13.2025.3.00.0000","2025-03-26","2025-08-01","MS 3.099/DF","1993-09-15","Administrativo - Servidor Público Civil - Reajustes de Remuneração, Proventos ou Pensão - Índice de 28,86% Lei 8.622/1993 e 8.627/1993","2000-06-07","União","Ministério da Saúde","Índice de 28,86% Lei 8.622/1993 e 8.627/1993","Dedução de Honorários Contratuais","Alimentar","Não","Não","Não","-","-","Não informada","Não Informada","NÃO",3546.84,354.68,0,0,0,3192.16,1195.45,131.49,262.98,63,840.77,131.49,3690.06,369,0,0,0,3321.06,1243.72,136.80000000000001,273.60000000000002,874.72,136.80000000000001]
[null,113,19979,"0105589-50.2025.3.00.0000","2025-03-26","2025-08-01","MS 3.099/DF","1993-09-15","Administrativo - Servidor Público Civil - Reajustes de Remuneração, Proventos ou Pensão - Índice de 28,86% Lei 8.622/1993 e 8.627/1993","2000-06-07","União","Ministério da Saúde","Índice de 28,86% Lei 8.622/1993 e 8.627/1993","Dedução de Honorários Contratuais","Alimentar","Não","Não","Não","-","-","Não informada","Não Informada","NÃO",4293.78,429.37,0,0,0,3864.41,1459.78,160.57,321.14,63,1030.4100000000001,160.57,4467.16,446.71,0,0,0,4020.45,1518.72,167.05,334.1,1072.01,167.05]
[null,114,19980,"0105592-05.2025.3.00.0000","2025-03-26","2025-08-01","MS 3.099/DF","1993-09-15","Administrativo - Servidor Público Civil - Reajustes de Remuneração, Proventos ou Pensão - Índice de 28,86% Lei 8.622/1993 e 8.627/1993","2000-06-07","União","Ministério da Saúde","Índice de 28,86% Lei 8.622/1993 e 8.627/1993","Dedução de Honorários Contratuais","Alimentar","Não","Não","Não","-","-","Não informada","Não Informada","NÃO",4198.78,419.87,0,0,0,3778.91,1393.85,153.32,306.64,63,973.98,153.32,4368.32,436.83,0,0,0,3931.49,1450.13,159.51,319.02,1013.3,159.51]
[null,115,19981,"0105594-72.2025.3.00.0000","2025-03-26","2025-08-01","MS 3.099/DF","1993-09-15","Administrativo - Servidor Público Civil - Reajustes de Remuneração, Proventos ou Pensão - Índice de 28,86% Lei 8.622/1993 e 8.627/1993","2000-06-07","União","Ministério da Saúde","Índice de 28,86% Lei 8.622/1993 e 8.627/1993","Dedução de Honorários Contratuais","Alimentar","Não","Não","Não","-","-","Não informada","Não Informada","NÃO",3631.67,363.16,0,0,0,3268.51,1239,136.29,272.58,63,875.84,136.29,3778.32,377.83,0,0,0,3400.49,1289.03,141.79,283.58,911.2,141.79]
[null,116,19982,"0105627-62.2025.3.00.0000","2025-03-26","2025-08-01","MS 3.099/DF","1993-09-15","Administrativo - Servidor Público Civil - Reajustes de Remuneração, Proventos ou Pensão - Índice de 28,86% Lei 8.622/1993 e 8.627/1993","2000-06-07","União","Ministério da Saúde","Índice de 28,86% Lei 8.622/1993 e 8.627/1993","Dedução de Honorários Contratuais","Alimentar","Não","Não","Não","-","-","Não informada","Não Informada","NÃO",5102.25,510.22,0,0,0,4592.03,1760.06,193.6,387.2,63,1249.8399999999999,193.6,5308.28,530.82000000000005,0,0,0,4777.46,1831.13,201.42,402.84,1300.31,201.42]
[null,117,19983,"0105634-54.2025.3.00.0000","2025-03-26","2025-08-01","MS 3.099/DF","1993-09-15","Administrativo - Servidor Público Civil - Reajustes de Remuneração, Proventos ou Pensão - Índice de 28,86% Lei 8.622/1993 e 8.627/1993","2000-06-07","União","Ministério da Saúde","Índice de 28,86% Lei 8.622/1993 e 8.627/1993","Dedução de Honorários Contratuais","Alimentar","Não","Não","Não","-","-","Não informada","Não Informada","NÃO",3682.33,368.23,0,0,0,3314.1,1302.72,143.29,286.58,63,934.49,143.29,3831.02,383.1,0,0,0,3447.92,1355.32,149.08000000000001,298.16000000000003,972.22,149.08000000000001]
[null,118,19984,"0105637-09.2025.3.00.0000","2025-03-26","2025-08-01","MS 3.099/DF","1993-09-15","Administrativo - Servidor Público Civil - Reajustes de Remuneração, Proventos ou Pensão - Índice de 28,86% Lei 8.622/1993 e 8.627/1993","2000-06-07","União","Ministério da Saúde","Índice de 28,86% Lei 8.622/1993 e 8.627/1993","Dedução de Honorários Contratuais","Alimentar","Não","Não","Não","-","-","Não informada","Não Informada","NÃO",4423.63,442.36,0,0,0,3981.27,1504.27,165.46,330.92,63,1061.9100000000001,165.46,4602.25,460.22,0,0,0,4142.03,1565.01,172.15,344.3,1104.79,172.15]
[null,119,19985,"0105640-61.2025.3.00.0000","2025-03-26","2025-08-01","MS 3.099/DF","1993-09-15","Administrativo - Servidor Público Civil - Reajustes de Remuneração, Proventos ou Pensão - Índice de 28,86% Lei 8.622/1993 e 8.627/1993","2000-06-07","União","Ministério da Saúde","Índice de 28,86% Lei 8.622/1993 e 8.627/1993","x.x.x","Alimentar","Não","Não","Não","-","-","Não informada","Não Informada","NÃO",2168.8000000000002,0,0,0,0,2168.8000000000002,725.2,79.77,159.54,63,725.2,79.77,2256.37,0,0,0,0,2256.37,754.48,82.99,165.98,754.48,82.99]
[null,120,19986,"0105648-38.2025.3.00.0000","2025-03-26","2025-08-01","MS 15.811/DF","2010-11-04","Administrativo - Servidor Público Civil - Processo Administrativo Disciplinar ou Sindicância","2013-10-21","União","-","Honorários de sucumbência","x.x.x","Alimentar","Não","Não","Não","-","-","Não informada","Não Informada","NÃO",13478.13,0,0,0,0,13478.13,0,0,0,0,0,0,14224.81,0,0,0,0,14224.81,0,0,0,0,0]
[null,121,19988,"0108613-86.2025.3.00.0000","2025-03-27","2025-08-01","AR 1.169/CE","1999-10-18","Administrativo - Servidor Público Civil - Sistema Remuneratório e Benefícios","2004-06-07","Instituto Nacional do Seguro Social – INSS","Instituto Nacional do Seguro Social - INSS","Anuênios","Dedução de Honorários Contratuais","Alimentar","Não","Não","Não","-","-","Não informada","Não Informada","NÃO",38932.660000000003,7786.53,0,0,0,31146.13,5101.42,561.15,1122.3,47,6707.84,561.15,40504.83,8100.96,0,0,0,32403.87,5384.03,592.24,1184.48,6978.72,592.24]
[null,122,19989,"0108618-11.2025.3.00.0000","2025-03-27","2025-08-01","AR 1.169/CE","1999-10-18","Administrativo - Servidor Público Civil - Sistema Remuneratório e Benefícios","2004-06-07","Instituto Nacional do Seguro Social – INSS","Instituto Nacional do Seguro Social - INSS","Anuênios","Dedução de Honorários Contratuais","Alimentar","Não","Não","Não","-","-","Não informada","Não Informada","NÃO",15935.91,1593.59,0,0,0,14342.32,5202.6099999999997,572.28,1144.56,47,4339.24,572.28,16579.419999999998,1657.94,0,0,0,14921.48,5490.83,603.99,1207.98,4514.46,603.99]
[null,123,19990,"0108620-78.2025.3.00.0000","2025-03-27","2025-08-01","AR 1.169/CE","1999-10-18","Administrativo - Servidor Público Civil - Sistema Remuneratório e Benefícios","2004-06-07","Instituto Nacional do Seguro Social – INSS","Instituto Nacional do Seguro Social - INSS","Anuênios","Dedução de Honorários Contratuais","Alimentar","Não","Não","Não","-","-","Não informada","Não Informada","NÃO",6277.21,627.72,0,0,0,5649.49,2343.4299999999998,257.77,515.54,47,1715.71,257.77,6530.69,653.05999999999995,0,0,0,5877.63,2438.06,268.18,536.36,1785,268.18]
[null,124,19991,"0108643-24.2025.3.00.0000","2025-03-27","2025-08-01","AR 1.169/CE","1999-10-18","Administrativo - Servidor Público Civil - Sistema Remuneratório e Benefícios","2004-06-07","Instituto Nacional do Seguro Social – INSS","Instituto Nacional do Seguro Social - INSS","Anuênios","Dedução de Honorários Contratuais","Alimentar","Não","Não","Não","-","-","Não informada","Não Informada","NÃO",2973.89,297.38,0,0,0,2676.51,1107.1600000000001,121.78,243.56,47,809.78,121.78,3093.97,309.39,0,0,0,2784.58,1151.8599999999999,126.7,253.4,842.47,126.7]
[null,125,19992,"0108652-83.2025.3.00.0000","2025-03-27","2025-08-01","AR 1.169/CE","1999-10-18","Administrativo - Servidor Público Civil - Sistema Remuneratório e Benefícios","2004-06-07","Instituto Nacional do Seguro Social – INSS","Instituto Nacional do Seguro Social - INSS","Anuênios","Dedução de Honorários Contratuais","Alimentar","Não","Não","Não","-","-","Não informada","Não Informada","NÃO",15407.05,1540.7,0,0,0,13866.35,5767.85,634.46,1268.92,47,4227.1499999999996,634.46,16029.2,1602.92,0,0,0,14426.28,6000.76,660.08,1320.16,4397.84,660.08]
[null,126,19993,"0108653-68.2025.3.00.0000","2025-03-27","2025-08-01","AR 1.169/CE","1999-10-18","Administrativo - Servidor Público Civil - Sistema Remuneratório e Benefícios","2004-06-07","Instituto Nacional do Seguro Social – INSS","Instituto Nacional do Seguro Social - INSS","Anuênios","Dedução de Honorários Contratuais","Alimentar","Não","Não","Não","-","-","Não informada","Não Informada","NÃO",11585.92,2317.1799999999998,0,0,0,9268.74,1091.75,120.09,240.18,45,1996.18,120.09,12053.78,2410.75,0,0,0,9643.0300000000007,1152.23,126.74,253.48,2076.79,126.74]
[null,127,19994,"0108657-08.2025.3.00.0000","2025-03-27","2025-08-01","AR 1.169/CE","1999-10-18","Administrativo - Servidor Público Civil - Sistema Remuneratório e Benefícios","2004-06-07","Instituto Nacional do Seguro Social – INSS","Instituto Nacional do Seguro Social - INSS","Anuênios","Dedução de Honorários Contratuais","Alimentar","Não","Não","Não","-","-","Não informada","Não Informada","NÃO",8894.77,889.47,0,0,0,8005.3,3325.26,365.77,731.54,47,2435.79,365.77,9253.9500000000007,925.39,0,0,0,8328.56,3459.54,380.54,761.08,2534.15,380.54]
[null,128,19995,"0108665-82.2025.3.00.0000","2025-03-27","2025-08-01","AR 1.169/CE","1999-10-18","Administrativo - Servidor Público Civil - Sistema Remuneratório e Benefícios","2004-06-07","Instituto Nacional do Seguro Social – INSS","Instituto Nacional do Seguro Social - INSS","Anuênios","Dedução de Honorários Contratuais","Alimentar","Não","Não","Não","-","-","Não informada","Não Informada","NÃO",13435.24,2687.04,0,0,0,10748.2,5001.8500000000004,550.20000000000005,1100.4000000000001,47,2314.81,550.20000000000005,13977.77,2795.55,0,0,0,11182.22,5203.83,572.41999999999996,1144.8399999999999,2408.2800000000002,572.41999999999996]
[null,129,19996,"0108670-07.2025.3.00.0000","2025-03-27","2025-08-01","AR 1.169/CE","1999-10-18","Administrativo - Servidor Público Civil - Sistema Remuneratório e Benefícios","2004-06-07","Instituto Nacional do Seguro Social – INSS","Instituto Nacional do Seguro Social - INSS","Anuênios","Dedução de Honorários Contratuais","Alimentar","Não","Não","Não","-","-","Não informada","Não Informada","NÃO",6283.54,628.35,0,0,0,5655.19,2342.56,257.68,515.36,47,1714.21,257.68,6537.27,653.72,0,0,0,5883.55,2437.15,268.08,536.16,1783.43,268.08]
[null,130,19997,"0108702-12.2025.3.00.0000","2025-03-27","2025-08-01","AR 1.169/CE","1999-10-18","Administrativo - Servidor Público Civil - Sistema Remuneratório e Benefícios","2004-06-07","Instituto Nacional do Seguro Social – INSS","Instituto Nacional do Seguro Social - INSS","Anuênios","Dedução de Honorários Contratuais","Alimentar","Não","Não","Não","-","-","Não informada","Não Informada","NÃO",5883.49,588.34,0,0,0,5295.15,2190.38,240.94,481.88,47,1602.04,240.94,6121.07,612.1,0,0,0,5508.97,2278.83,250.67,501.34,1666.73,250.67]
[null,{"$f":"IF(C141=\"\",\"\",B140+1)","v":131},19999,"0108704-79.2025.3.00.0000","2025-03-27","2025-08-01","AR 1.169/CE","1999-10-18","Administrativo - Servidor Público Civil - Sistema Remuneratório e Benefícios","2004-06-07","Instituto Nacional do Seguro Social – INSS","Instituto Nacional do Seguro Social - INSS","Anuênios","Dedução de Honorários Contratuais","Alimentar","Não","Não","Não","-","-","Não informada","Não Informada","NÃO",4321.5600000000004,864.31,0,0,0,3457.25,1611.1,177.22,354.44,47,746.79,177.22,4496.0600000000004,899.21,0,0,0,3596.85,1676.15,184.37,368.74,776.94,184.37]
[null,132,20000,"0108709-04.2025.3.00.0000","2025-03-27","2025-08-01","AR 1.169/CE","1999-10-18","Administrativo - Servidor Público Civil - Sistema Remuneratório e Benefícios","2004-06-07","Instituto Nacional do Seguro Social – INSS","Instituto Nacional do Seguro Social - INSS","Anuênios","Dedução de Honorários Contratuais","Alimentar","Não","Não","Não","-","-","Não informada","Não Informada","NÃO",4164.59,416.45,0,0,0,3748.14,1550.45,170.54,341.08,47,1134,170.54,4332.76,433.27,0,0,0,3899.49,1613.06,177.43,354.86,1179.79,177.43]
[null,133,20001,"0108723-85.2025.3.00.0000","2025-03-27","2025-08-01","AR 1.169/CE","1999-10-18","Administrativo - Servidor Público Civil - Sistema Remuneratório e Benefícios","2004-06-07","Instituto Nacional do Seguro Social – INSS","Instituto Nacional do Seguro Social - INSS","Anuênios","Dedução de Honorários Contratuais","Alimentar","Não","Não","Não","-","-","Não informada","Não Informada","NÃO",18168.849999999999,3633.77,0,0,0,14535.08,2785.75,306.43,612.86,45,3130.36,306.43,18902.53,3780.5,0,0,0,15122.03,2940.08,323.39999999999998,646.79999999999995,3256.77,323.39999999999998]
[null,134,20002,"0108735-02.2025.3.00.0000","2025-03-27","2025-08-01","AR 1.169/CE","1999-10-18","Administrativo - Servidor Público Civil - Sistema Remuneratório e Benefícios","2004-06-07","Instituto Nacional do Seguro Social – INSS","Instituto Nacional do Seguro Social - INSS","Anuênios","Dedução de Honorários Contratuais","Alimentar","Não","Não","Não","-","-","Não informada","Não Informada","NÃO",6348.81,1269.76,0,0,0,5079.05,2366.89,260.35000000000002,520.70000000000005,47,1097.1300000000001,260.35000000000002,6605.17,1321.03,0,0,0,5284.14,2462.46,270.87,541.74,1141.43,270.87]
[null,135,20003,"0108797-42.2025.3.00.0000","2025-03-27","2025-08-01","AR 1.169/CE","1999-10-18","Administrativo - Servidor Público Civil - Sistema Remuneratório e Benefícios","2004-06-07","Instituto Nacional do Seguro Social – INSS","Instituto Nacional do Seguro Social - INSS","Anuênios","Dedução de Honorários Contratuais","Alimentar","Não","Não","Não","-","-","Não informada","Não Informada","NÃO",14675.51,1467.55,0,0,0,13207.96,5463.6,600.99,1201.98,47,3996.05,600.99,15268.13,1526.81,0,0,0,13741.32,5684.23,625.26,1250.52,4157.42,625.26]
[null,136,20004,"0108822-55.2025.3.00.0000","2025-03-27","2025-08-01","AR 1.169/CE","1999-10-18","Administrativo - Servidor Público Civil - Sistema Remuneratório e Benefícios","2004-06-07","Instituto Nacional do Seguro Social – INSS","Instituto Nacional do Seguro Social - INSS","Anuênios","Dedução de Honorários Contratuais","Alimentar","Não","Não","Não","-","-","Não informada","Não Informada","NÃO",43006.81,5998.2,0,0,0,37008.61,16011.15,1761.22,3522.44,47,10012.950000000001,1761.22,44743.5,6240.42,0,0,0,38503.08,16657.71,1832.34,3664.68,10417.290000000001,1832.34]
[null,137,20005,"0108829-47.2025.3.00.0000","2025-03-27","2025-08-01","AR 1.169/CE","1999-10-18","Administrativo - Servidor Público Civil - Sistema Remuneratório e Benefícios","2004-06-07","Instituto Nacional do Seguro Social – INSS","Instituto Nacional do Seguro Social - INSS","Anuênios","Dedução de Honorários Contratuais","Alimentar","Não","Não","Não","-","-","Não informada","Não Informada","NÃO",3495.35,349.53,0,0,0,3145.82,1308.53,143.93,287.86,47,959,143.93,3636.49,363.64,0,0,0,3272.85,1361.37,149.75,299.5,997.73,149.75]
[null,138,20006,"0108831-17.2025.3.00.0000","2025-03-27","2025-08-01","AR 1.169/CE","1999-10-18","Administrativo - Servidor Público Civil - Sistema Remuneratório e Benefícios","2004-06-07","Instituto Nacional do Seguro Social – INSS","Instituto Nacional do Seguro Social - INSS","Anuênios","Dedução de Honorários Contratuais","Alimentar","Não","Não","Não","-","-","Não informada","Não Informada","NÃO",15877.38,1587.73,0,0,0,14289.65,2485.0700000000002,273.35000000000002,546.70000000000005,47,4331.49,273.35000000000002,16518.53,1651.85,0,0,0,14866.68,2622.74,288.5,577,4506.3900000000003,288.5]
[null,139,20007,"0108833-84.2025.3.00.0000","2025-03-27","2025-08-01","AR 1.169/CE","1999-10-18","Administrativo - Servidor Público Civil - Sistema Remuneratório e Benefícios","2004-06-07","Instituto Nacional do Seguro Social – INSS","Instituto Nacional do Seguro Social - INSS","Anuênios","Dedução de Honorários Contratuais","Alimentar","Não","Não","Não","-","-","Não informada","Não Informada","NÃO",8860.84,886.08,0,0,0,7974.76,3312.58,364.38,728.76,47,2426.5,364.38,9218.64,921.86,0,0,0,8296.7800000000007,3446.34,379.09,758.18,2524.48,379.09]
[null,140,20008,"0108838-09.2025.3.00.0000","2025-03-27","2025-08-01","AR 1.169/CE","1999-10-18","Administrativo - Servidor Público Civil - Sistema Remuneratório e Benefícios","2004-06-07","Instituto Nacional do Seguro Social – INSS","Instituto Nacional do Seguro Social - INSS","Anuênios","Dedução de Honorários Contratuais","Alimentar","Não","Não","Não","-","-","Não informada","Não Informada","NÃO",6348.81,634.88,0,0,0,5713.93,2366.89,260.35000000000002,520.70000000000005,47,1732.01,260.35000000000002,6605.17,660.51,0,0,0,5944.66,2462.46,270.87,541.74,1801.95,270.87]
[null,141,20009,"0108860-67.2025.3.00.0000","2025-03-27","2025-08-01","MS 4.149/DF","1995-07-21","Administrativo - Servidor Público Civil - Sistema Remuneratório e Benefícios","1998-09-23","União","INCRA","Diferença de remuneração - 3,17%","Dedução de Honorários Contratuais","Alimentar","Não","Não","Não","-","-","Não informada","Não Informada","NÃO",6390.03,639,0,0,0,5751.03,0,0,0,85,1522.68,0,6648.06,664.8,0,0,0,5983.26,0,0,0,1584.17,0]
[null,142,20010,"0108882-28.2025.3.00.0000","2025-03-27","2025-08-01","MS 4.149/DF","1995-07-21","Administrativo - Servidor Público Civil - Sistema Remuneratório e Benefícios","1998-09-23","União","INCRA","Diferença de remuneração - 3,17%","Dedução de Honorários Contratuais","Alimentar","Não","Não","Não","-","-","Não informada","Não Informada","NÃO",41120.49,4112.04,0,0,0,37008.449999999997,13066.69,1437.33,2874.66,85,8954.65,1437.33,42781,4278.1000000000004,0,0,0,38502.9,13594.34,1495.37,2990.74,9316.24,1495.37]
[null,143,20011,"0108884-95.2025.3.00.0000","2025-03-27","2025-08-01","MS 4.149/DF","1995-07-21","Administrativo - Servidor Público Civil - Sistema Remuneratório e Benefícios","1998-09-23","União","INCRA","Diferença de remuneração - 3,17%","Dedução de Honorários Contratuais","Alimentar","Não","Não","Não","-","-","Não informada","Não Informada","NÃO",38045.339999999997,3804.53,0,0,0,34240.81,0,0,0,85,8051.4,0,39581.67,3958.16,0,0,0,35623.51,0,0,0,8376.5300000000007,0]
[null,144,20012,"0108889-20.2025.3.00.0000","2025-03-27","2025-08-01","MS 4.149/DF","1995-07-21","Administrativo - Servidor Público Civil - Sistema Remuneratório e Benefícios","1998-09-23","União","INCRA","Diferença de remuneração - 3,17%","Dedução de Honorários Contratuais","Alimentar","Não","Não","Não","-","-","Não informada","Não Informada","NÃO",30837.54,3083.75,0,0,0,27753.79,315.08,34.65,69.3,85,6771.47,34.65,32082.81,3208.28,0,0,0,28874.53,332.53,36.57,73.14,7044.91,36.57]
[null,145,20013,"0108891-87.2025.3.00.0000","2025-03-27","2025-08-01","MS 4.149/DF","1995-07-21","Administrativo - Servidor Público Civil - Sistema Remuneratório e Benefícios","1998-09-23","União","INCRA","Diferença de remuneração - 3,17%","Dedução de Honorários Contratuais","Alimentar","Não","Não","Não","-","-","Não informada","Não Informada","NÃO",39955.660000000003,3995.56,0,0,0,35960.1,22.51,2.4700000000000002,4.9400000000000004,85,9110.84,2.4700000000000002,41569.14,4156.91,0,0,0,37412.230000000003,23.75,2.61,5.22,9478.75,2.61]
[null,146,20014,"0108895-27.2025.3.00.0000","2025-03-27","2025-08-01","MS 4.149/DF","1995-07-21","Administrativo - Servidor Público Civil - Sistema Remuneratório e Benefícios","1998-09-23","União","INCRA","Diferença de remuneração - 3,17%","Dedução de Honorários Contratuais","Alimentar","Não","Não","Não","-","-","Não informada","Não Informada","NÃO",21304.21,2130.42,0,0,0,19173.79,5030.66,553.37,1106.74,51,2900.24,553.37,22164.5,2216.4499999999998,0,0,0,19948.05,5233.8,575.71,1151.42,3017.35,575.71]
[null,147,20015,"0108896-12.2025.3.00.0000","2025-03-27","2025-08-01","MS 4.149/DF","1995-07-21","Administrativo - Servidor Público Civil - Sistema Remuneratório e Benefícios","1998-09-23","União","INCRA","Diferença de remuneração - 3,17%","Dedução de Honorários Contratuais","Alimentar","Não","Não","Não","-","-","Não informada","Não Informada","NÃO",47671.65,4767.16,0,0,0,42904.49,11918.81,1311.06,2622.12,77,10245.15,1311.06,49596.71,4959.67,0,0,0,44637.04,12579.11,1383.7,2767.4,10658.86,1383.7]
[null,148,20016,"0108897-94.2025.3.00.0000","2025-03-27","2025-08-01","MS 4.149/DF","1995-07-21","Administrativo - Servidor Público Civil - Sistema Remuneratório e Benefícios","1998-09-23","União","INCRA","Diferença de remuneração - 3,17%","Dedução de Honorários Contratuais","Alimentar","Não","Não","Não","-","-","Não informada","Não Informada","NÃO",29389.59,2938.95,0,0,0,26450.639999999999,1963.1,215.94,431.88,59,6624.51,215.94,30576.39,3057.63,0,0,0,27518.76,2071.85,227.9,455.8,6892.02,227.9]
[null,149,20017,"0108898-79.2025.3.00.0000","2025-03-27","2025-08-01","MS 4.149/DF","1995-07-21","Administrativo - Servidor Público Civil - Sistema Remuneratório e Benefícios","1998-09-23","União","INCRA","Diferença de remuneração - 3,17%","Dedução de Honorários Contratuais","Alimentar","Não","Não","Não","-","-","Não informada","Não Informada","NÃO",27014.57,2701.45,0,0,0,24313.119999999999,0,0,0,77,5644.61,0,28105.47,2810.54,0,0,0,25294.93,0,0,0,5872.55,0]
[null,150,20018,"0108901-34.2025.3.00.0000","2025-03-27","2025-08-01","MS 4.149/DF","1995-07-21","Administrativo - Servidor Público Civil - Sistema Remuneratório e Benefícios","1998-09-23","União","INCRA","Diferença de remuneração - 3,17%","Dedução de Honorários Contratuais","Alimentar","Não","Não","Não","-","-","Não informada","Não Informada","NÃO",33890.629999999997,3389.06,0,0,0,30501.57,0,0,0,65,5483.26,0,35259.19,3525.91,0,0,0,31733.279999999999,0,0,0,5704.69,0]
[null,151,20019,"0108903-04.2025.3.00.0000","2025-03-27","2025-08-01","MS 4.149/DF","1995-07-21","Administrativo - Servidor Público Civil - Sistema Remuneratório e Benefícios","1998-09-23","União","INCRA","Diferença de remuneração - 3,17%","Dedução de Honorários Contratuais","Alimentar","Não","Não","Não","-","-","Não informada","Não Informada","NÃO",40609.699999999997,4060.97,0,0,0,36548.730000000003,1951,214.61,429.22,85,9029.9500000000007,214.61,42249.59,4224.95,0,0,0,38024.639999999999,2059.08,226.49,452.98,9394.6,226.49]
[null,152,20020,"0108905-71.2025.3.00.0000","2025-03-27","2025-08-01","MS 4.149/DF","1995-07-21","Administrativo - Servidor Público Civil - Sistema Remuneratório e Benefícios","1998-09-23","União","INCRA","Diferença de remuneração - 3,17%","Dedução de Honorários Contratuais","Alimentar","Não","Não","Não","-","-","Não informada","Não Informada","NÃO",38838.71,3883.87,0,0,0,34954.839999999997,0,0,0,77,8477.5499999999993,0,40407.08,4040.7,0,0,0,36366.379999999997,0,0,0,8819.89,0]
[null,153,20021,"0108908-26.2025.3.00.0000","2025-03-27","2025-08-01","MS 4.149/DF","1995-07-21","Administrativo - Servidor Público Civil - Sistema Remuneratório e Benefícios","1998-09-23","União","INCRA","Diferença de remuneração - 3,17%","Dedução de Honorários Contratuais","Alimentar","Não","Não","Não","-","-","Não informada","Não Informada","NÃO",46668.65,4666.8599999999997,0,0,0,42001.79,5024.21,552.66,1105.32,65,10920.81,552.66,48553.22,4855.32,0,0,0,43697.9,5302.55,583.28,1166.56,11361.81,583.28]
[null,154,20022,"0108910-93.2025.3.00.0000","2025-03-27","2025-08-01","MS 4.149/DF","1995-07-21","Administrativo - Servidor Público Civil - Sistema Remuneratório e Benefícios","1998-09-23","União","INCRA","Diferença de remuneração - 3,17%","Dedução de Honorários Contratuais","Alimentar","Não","Não","Não","-","-","Não informada","Não Informada","NÃO",19673.03,1967.3,0,0,0,17705.73,4839.43,532.33000000000004,1064.6600000000001,85,2872.13,532.33000000000004,20467.46,2046.74,0,0,0,18420.72,5034.8500000000004,553.83000000000004,1107.6600000000001,2988.11,553.83000000000004]
[null,155,20027,"0109558-73.2025.3.00.0000","2025-03-28","2025-08-01","MS 4.149/DF","1995-07-21","Administrativo - Servidor Público Civil - Sistema Remuneratório e Benefícios","1998-09-23","União","INCRA","Diferença de remuneração - 3,17%","Dedução de Honorários Contratuais","Alimentar","Não","Não","Não","-","-","Não informada","Não Informada","NÃO",31475.49,3147.54,0,0,0,28327.95,0,0,0,65,4809.8,0,32746.52,3274.65,0,0,0,29471.87,0,0,0,5004.0200000000004,0]
[null,156,20028,"0109584-71.2025.3.00.0000","2025-03-28","2025-08-01","MS 4.149/DF","1995-07-21","Administrativo - Servidor Público Civil - Sistema Remuneratório e Benefícios","1998-09-23","União","INCRA","Diferença de remuneração - 3,17%","Dedução de Honorários Contratuais","Alimentar","Não","Não","Não","-","-","Não informada","Não Informada","NÃO",32678.79,3267.87,0,0,0,29410.92,0,0,0,85,6919.96,0,33998.410000000003,3399.84,0,0,0,30598.57,0,0,0,7199.39,0]
[null,157,20029,"0109591-63.2025.3.00.0000","2025-03-28","2025-08-01","MS 4.149/DF","1995-07-21","Administrativo - Servidor Público Civil - Sistema Remuneratório e Benefícios","1998-09-23","União","INCRA","Diferença de remuneração - 3,17%","Dedução de Honorários Contratuais","Alimentar","Não","Não","Não","-","-","Não informada","Não Informada","NÃO",30220.41,3022.04,0,0,0,27198.37,9655.18,1062.06,2124.12,85,6633.14,1062.06,31440.76,3144.07,0,0,0,28296.69,10045.07,1104.95,2209.9,6901,1104.95]
[null,158,20030,"0109977-93.2025.3.00.0000","2025-03-28","2025-08-01","MS 4.149/DF","1995-07-21","Administrativo - Servidor Público Civil - Sistema Remuneratório e Benefícios","1998-09-23","União","INCRA","Diferença de remuneração - 3,17%","Dedução de Honorários Contratuais","Alimentar","Não","Não","Não","-","-","Não informada","Não Informada","NÃO",40123.040000000001,4012.3,0,0,0,36110.74,0,0,0,85,9976.2999999999993,0,41743.279999999999,4174.32,0,0,0,37568.959999999999,0,0,0,10379.16,0]
[null,159,20031,"0110022-97.2025.3.00.0000","2025-03-28","2025-08-01","MS 4.149/DF","1995-07-21","Administrativo - Servidor Público Civil - Sistema Remuneratório e Benefícios","1998-09-23","União","INCRA","Diferença de remuneração - 3,17%","Dedução de Honorários Contratuais","Alimentar","Não","Não","Não","-","-","Não informada","Não Informada","NÃO",44002.6,4400.26,0,0,0,39602.339999999997,0,0,0,85,9770.33,0,45779.5,4577.95,0,0,0,41201.550000000003,0,0,0,10164.870000000001,0]
[null,160,20032,"0110075-78.2025.3.00.0000","2025-03-28","2025-08-01","MS 3.901/DF","1995-03-08","Administrativo - Servidor Público Civil - Reajustes de Remuneração, Proventos ou Pensão","2007-11-07","União","Ministério da Fazenda","Diferença de remuneração - 3,17%","Dedução de Honorários Contratuais","Alimentar","Não","Não","Não","-","-","Não informada","Não Informada","NÃO",52154.74,4172.37,0,0,0,47982.37,20319.23,2235.11,4470.22,25,16146.86,2235.11,54260.85,4340.8599999999997,0,0,0,49919.99,21139.759999999998,2325.37,4650.74,16798.900000000001,2325.37]
[null,161,20034,"0116093-18.2025.3.00.0000","2025-04-02","2025-08-01","MS 6.019/DF","1998-10-22","Administrativo - Servidor Público Civil - Sistema Remuneratório e Benefícios","2007-12-10","Instituto Nacional do Seguro Social – INSS","Instituto Nacional do Seguro Social - INSS","Reajuste Salarial - Resíduo de 3,17%","Dedução de Honorários Contratuais","Alimentar","Não","Não","Não","-","-","Não informada","Não Informada","NÃO",66078.649999999994,4295.1099999999997,0,0,0,61783.54,0,0,0,43,25093.82,0,68747.03,4468.55,0,0,0,64278.48,0,0,0,26107.16,0]
[null,162,20035,"0116100-10.2025.3.00.0000","2025-04-02","2025-08-01","MS 4.151/DF","1995-07-21","Administrativo - Servidor Público Civil - Reajustes de Remuneração, Proventos ou Pensão","1999-02-12","União","Ministério da Fazenda","Diferença de remuneração - 3,17%","Dedução de Honorários Contratuais","Alimentar","Não","Não","Não","-","-","Não informada","Não Informada","NÃO",81836.08,6546.88,818.36,818.36,0,73652.479999999996,30722.02,3379.42,6758.84,39,22538.37,3379.42,85140.77,6811.26,851.4,851.4,0,76626.710000000006,32424.01,3566.64,7133.28,23448.52,3566.64]
[null,163,20036,"0116109-69.2025.3.00.0000","2025-04-02","2025-08-01","MS 4.151/DF","1995-07-21","Administrativo - Servidor Público Civil - Reajustes de Remuneração, Proventos ou Pensão","1999-02-12","União","Ministério da Fazenda","Diferença de remuneração - 3,17%","Dedução de Honorários Contratuais","Alimentar","Não","Não","Não","-","-","Não informada","Não Informada","NÃO",69330.19,4159.8100000000004,693.3,693.3,0,63783.78,40350.400000000001,4438.54,8877.08,53,14424.94,4438.54,72129.87,4327.79,721.29,721.29,0,66359.5,42585.81,4684.43,9368.86,15007.46,4684.43]
[null,164,20037,"0116110-54.2025.3.00.0000","2025-04-02","2025-08-01","MS 6.019/DF","1998-10-22","Administrativo - Servidor Público Civil - Sistema Remuneratório e Benefícios","2007-12-10","Instituto Nacional do Seguro Social – INSS","Instituto Nacional do Seguro Social - INSS","Reajuste Salarial - Resíduo de 3,17%","Dedução de Honorários Contratuais","Alimentar","Não","Não","Não","-","-","Não informada","Não Informada","NÃO",17759.87,1154.3900000000001,0,0,0,16605.48,0,0,0,43,6717.61,0,18477.04,1201,0,0,0,17276.04,0,0,0,6988.88,0]
[null,165,20038,"0116122-68.2025.3.00.0000","2025-04-02","2025-08-01","MS 4.151/DF","1995-07-21","Administrativo - Servidor Público Civil - Reajustes de Remuneração, Proventos ou Pensão","1999-02-12","União","Ministério da Fazenda","Diferença de remuneração - 3,17%","Dedução de Honorários Contratuais","Alimentar","Não","Não","Não","-","-","Não informada","Não Informada","NÃO",89017.57,5341.05,890.17,890.17,0,81896.179999999993,0,0,0,50,23704.58,0,92612.27,5556.73,926.12,926.12,0,85203.3,0,0,0,24661.81,0]
[null,166,20039,"0116123-53.2025.3.00.0000","2025-04-02","2025-08-01","MS 6.019/DF","1998-10-22","Administrativo - Servidor Público Civil - Sistema Remuneratório e Benefícios","2007-12-10","Instituto Nacional do Seguro Social – INSS","Instituto Nacional do Seguro Social - INSS","Reajuste Salarial - Resíduo de 3,17%","Dedução de Honorários Contratuais","Alimentar","Não","Não","Não","-","-","Não informada","Não Informada","NÃO",68490.39,4451.87,0,0,0,64038.52,0,0,0,43,26271.39,0,71256.160000000003,4631.6499999999996,0,0,0,66624.509999999995,0,0,0,27332.27,0]
[null,167,20040,"0116132-15.2025.3.00.0000","2025-04-02","2025-08-01","MS 6.019/DF","1998-10-22","Administrativo - Servidor Público Civil - Sistema Remuneratório e Benefícios","2007-12-10","Instituto Nacional do Seguro Social – INSS","Instituto Nacional do Seguro Social - INSS","Reajuste Salarial - Resíduo de 3,17%","Dedução de Honorários Contratuais","Alimentar","Não","Não","Não","-","-","Não informada","Não Informada","NÃO",36715.11,2386.48,0,0,0,34328.629999999997,0,0,0,43,14192.15,0,38197.730000000003,2482.85,0,0,0,35714.879999999997,0,0,0,14765.25,0]
[null,168,20041,"0116191-03.2025.3.00.0000","2025-04-02","2025-08-01","MS 6.019/DF","1998-10-22","Administrativo - Servidor Público Civil - Sistema Remuneratório e Benefícios","2007-12-10","Instituto Nacional do Seguro Social – INSS","Instituto Nacional do Seguro Social - INSS","Reajuste Salarial - Resíduo de 3,17%","Dedução de Honorários Contratuais","Alimentar","Não","Não","Não","-","-","Não informada","Não Informada","NÃO",70302.84,4569.68,0,0,0,65733.16,0,0,0,43,26741.38,0,73141.8,4754.21,0,0,0,68387.59,0,0,0,27821.25,0]
[null,169,20042,"0116238-74.2025.3.00.0000","2025-04-02","2025-08-01","MS 6.019/DF","1998-10-22","Administrativo - Servidor Público Civil - Sistema Remuneratório e Benefícios","2007-12-10","Instituto Nacional do Seguro Social – INSS","Instituto Nacional do Seguro Social - INSS","Reajuste Salarial - Resíduo de 3,17%","Dedução de Honorários Contratuais","Alimentar","Não","Não","Não","-","-","Não informada","Não Informada","NÃO",66562.7,4326.57,0,0,0,62236.13,0,0,0,43,25641.21,0,69250.62,4501.29,0,0,0,64749.33,0,0,0,26676.639999999999,0]
[null,170,20043,"0116240-44.2025.3.00.0000","2025-04-02","2025-08-01","MS 6.019/DF","1998-10-22","Administrativo - Servidor Público Civil - Sistema Remuneratório e Benefícios","2007-12-10","Instituto Nacional do Seguro Social – INSS","Instituto Nacional do Seguro Social - INSS","Reajuste Salarial - Resíduo de 3,17%","Dedução de Honorários Contratuais","Alimentar","Não","Não","Não","-","-","Não informada","Não Informada","NÃO",49354.85,3208.06,0,0,0,46146.79,0,0,0,43,18637.91,0,51347.89,3337.61,0,0,0,48010.28,0,0,0,19390.54,0]
[null,171,20044,"0116275-04.2025.3.00.0000","2025-04-02","2025-08-01","MS 6.019/DF","1998-10-22","Administrativo - Servidor Público Civil - Sistema Remuneratório e Benefícios","2007-12-10","Instituto Nacional do Seguro Social – INSS","Instituto Nacional do Seguro Social - INSS","Reajuste Salarial - Resíduo de 3,17%","Dedução de Honorários Contratuais","Alimentar","Não","Não","Não","-","-","Não informada","Não Informada","NÃO",69442.289999999994,4513.74,0,0,0,64928.55,0,0,0,43,26256.85,0,72246.490000000005,4696.0200000000004,0,0,0,67550.47,0,0,0,27317.14,0]
[null,172,20045,"0116281-11.2025.3.00.0000","2025-04-02","2025-08-01","MS 6.019/DF","1998-10-22","Administrativo - Servidor Público Civil - Sistema Remuneratório e Benefícios","2007-12-10","Instituto Nacional do Seguro Social – INSS","Instituto Nacional do Seguro Social - INSS","Reajuste Salarial - Resíduo de 3,17%","Dedução de Honorários Contratuais","Alimentar","Não","Não","Não","-","-","Não informada","Não Informada","NÃO",43550.58,2830.78,0,0,0,40719.800000000003,0,0,0,38,16595.73,0,45309.23,2945.09,0,0,0,42364.14,0,0,0,17265.900000000001,0]
[null,173,20046,"0116283-78.2025.3.00.0000","2025-04-02","2025-08-01","MS 6.019/DF","1998-10-22","Administrativo - Servidor Público Civil - Sistema Remuneratório e Benefícios","2007-12-10","Instituto Nacional do Seguro Social – INSS","Instituto Nacional do Seguro Social - INSS","Reajuste Salarial - Resíduo de 3,17%","Dedução de Honorários Contratuais","Alimentar","Não","Não","Não","-","-","Não informada","Não Informada","NÃO",51991.23,3379.42,0,0,0,48611.81,0,0,0,43,19385.32,0,54090.73,3515.89,0,0,0,50574.84,0,0,0,20168.13,0]
[null,174,20048,"0116292-40.2025.3.00.0000","2025-04-02","2025-08-01","MS 6.019/DF","1998-10-22","Administrativo - Servidor Público Civil - Sistema Remuneratório e Benefícios","2007-12-10","Instituto Nacional do Seguro Social – INSS","Instituto Nacional do Seguro Social - INSS","Reajuste Salarial - Resíduo de 3,17%","Dedução de Honorários Contratuais","Alimentar","Não","Não","Não","-","-","Não informada","Não Informada","NÃO",64908.52,4219.05,0,0,0,60689.47,0,0,0,43,25533.51,0,67529.64,4389.42,0,0,0,63140.22,0,0,0,26564.6,0]
[null,175,20050,"0116296-77.2025.3.00.0000","2025-04-02","2025-08-01","MS 6.019/DF","1998-10-22","Administrativo - Servidor Público Civil - Sistema Remuneratório e Benefícios","2007-12-10","Instituto Nacional do Seguro Social – INSS","Instituto Nacional do Seguro Social - INSS","Reajuste Salarial - Resíduo de 3,17%","Dedução de Honorários Contratuais","Alimentar","Não","Não","Não","-","-","Não informada","Não Informada","NÃO",69183.61,4496.93,0,0,0,64686.68,0,0,0,43,26138.35,0,71977.37,4678.5200000000004,0,0,0,67298.850000000006,0,0,0,27193.87,0]
[null,176,20051,"0116297-62.2025.3.00.0000","2025-04-02","2025-08-01","MS 6.864/DF","2000-04-05","Administrativo - Servidor Público Civil - Sistema Remuneratório e Benefícios","2006-05-03","Instituto Nacional do Seguro Social – INSS","Ministério do Planejamento, Orçamento e Gestão","Reajuste  3,17% - Lei 8.880/94","Dedução de Honorários Contratuais","Alimentar","Não","Não","Não","-","-","Não informada","Não Informada","NÃO",35772.300000000003,2146.33,0,0,0,33625.97,0,0,0,12,13270.92,0,37216.839999999997,2233.0100000000002,0,0,0,34983.83,0,0,0,13806.81,0]
[null,177,20052,"0116306-24.2025.3.00.0000","2025-04-02","2025-08-01","MS 6.019/DF","1998-10-22","Administrativo - Servidor Público Civil - Sistema Remuneratório e Benefícios","2007-12-10","Instituto Nacional do Seguro Social – INSS","Instituto Nacional do Seguro Social - INSS","Reajuste Salarial - Resíduo de 3,17%","Dedução de Honorários Contratuais","Alimentar","Não","Não","Não","-","-","Não informada","Não Informada","NÃO",14976.28,973.45,0,0,0,14002.83,0,0,0,43,5741.69,0,15581.05,1012.76,0,0,0,14568.29,0,0,0,5973.55,0]
[null,178,20053,"0116307-09.2025.3.00.0000","2025-04-02","2025-08-01","MS 6.864/DF","2000-04-05","Administrativo - Servidor Público Civil - Sistema Remuneratório e Benefícios","2006-05-03","Instituto Nacional do Seguro Social – INSS","Ministério do Planejamento, Orçamento e Gestão","Reajuste  3,17% - Lei 8.880/94","Dedução de Honorários Contratuais","Alimentar","Não","Não","Não","-","-","Não informada","Não Informada","NÃO",5900.51,354.03,0,0,0,5546.48,0,0,0,2,2101.5300000000002,0,6138.78,368.32,0,0,0,5770.46,0,0,0,2186.4,0]
[null,179,20054,"0116312-31.2025.3.00.0000","2025-04-02","2025-08-01","MS 6.019/DF","1998-10-22","Administrativo - Servidor Público Civil - Sistema Remuneratório e Benefícios","2007-12-10","Instituto Nacional do Seguro Social – INSS","Instituto Nacional do Seguro Social - INSS","Reajuste Salarial - Resíduo de 3,17%","Dedução de Honorários Contratuais","Alimentar","Não","Não","Não","-","-","Não informada","Não Informada","NÃO",69720.72,4531.84,0,0,0,65188.88,0,0,0,43,26400.74,0,72536.17,4714.8500000000004,0,0,0,67821.320000000007,0,0,0,27466.84,0]
[null,180,20056,"0116345-21.2025.3.00.0000","2025-04-02","2025-08-01","MS 6.019/DF","1998-10-22","Administrativo - Servidor Público Civil - Sistema Remuneratório e Benefícios","2007-12-10","Instituto Nacional do Seguro Social – INSS","Instituto Nacional do Seguro Social - INSS","Reajuste Salarial - Resíduo de 3,17%","Dedução de Honorários Contratuais","Alimentar","Não","Não","Não","-","-","Não informada","Não Informada","NÃO",56734.31,3687.73,0,0,0,53046.58,0,0,0,43,21558.31,0,59025.34,3836.64,0,0,0,55188.7,0,0,0,22428.880000000001,0]
[null,181,20062,"0116469-04.2025.3.00.0000","2025-04-02","2025-08-01","MS 6.019/DF","1998-10-22","Administrativo - Servidor Público Civil - Sistema Remuneratório e Benefícios","2007-12-10","Instituto Nacional do Seguro Social – INSS","Instituto Nacional do Seguro Social - INSS","Reajuste Salarial - Resíduo de 3,17%","Dedução de Honorários Contratuais","Alimentar","Não","Não","Não","-","-","Não informada","Não Informada","NÃO",35912.31,2334.3000000000002,0,0,0,33578.01,16237.17,1786.08,3572.16,43,13902.87,1786.08,37362.51,2428.56,0,0,0,34933.949999999997,16892.849999999999,1858.21,3716.42,14464.29,1858.21]
[null,182,20064,"0116482-03.2025.3.00.0000","2025-04-02","2025-08-01","MS 6.019/DF","1998-10-22","Administrativo - Servidor Público Civil - Sistema Remuneratório e Benefícios","2007-12-10","Instituto Nacional do Seguro Social – INSS","Instituto Nacional do Seguro Social - INSS","Reajuste Salarial - Resíduo de 3,17%","Dedução de Honorários Contratuais","Alimentar","Não","Não","Não","-","-","Não informada","Não Informada","NÃO",27841.66,1809.7,0,0,0,26031.96,11401.27,1254.1300000000001,2508.2600000000002,25,9591.57,1254.1300000000001,28965.95,1882.78,0,0,0,27083.17,11861.67,1304.78,2609.56,9978.89,1304.78]
[null,183,20065,"0116497-69.2025.3.00.0000","2025-04-02","2025-08-01","MS 6.019/DF","1998-10-22","Administrativo - Servidor Público Civil - Sistema Remuneratório e Benefícios","2007-12-10","Instituto Nacional do Seguro Social – INSS","Instituto Nacional do Seguro Social - INSS","Reajuste Salarial - Resíduo de 3,17%","Dedução de Honorários Contratuais","Alimentar","Não","Não","Não","-","-","Não informada","Não Informada","NÃO",48985.74,3184.07,0,0,0,45801.67,22535.83,2478.94,4957.88,43,19351.759999999998,2478.94,50963.87,3312.65,0,0,0,47651.22,23445.87,2579.04,5158.08,20133.22,2579.04]
[null,184,20066,"0116507-16.2025.3.00.0000","2025-04-02","2025-08-01","MS 6.019/DF","1998-10-22","Administrativo - Servidor Público Civil - Sistema Remuneratório e Benefícios","2007-12-10","Instituto Nacional do Seguro Social – INSS","Instituto Nacional do Seguro Social - INSS","Reajuste Salarial - Resíduo de 3,17%","Dedução de Honorários Contratuais","Alimentar","Não","Não","Não","-","-","Não informada","Não Informada","NÃO",51687.91,3359.71,0,0,0,48328.2,23734.99,2610.84,5221.68,43,20375.28,2610.84,53775.16,3495.38,0,0,0,50279.78,24693.45,2716.27,5432.54,21198.07,2716.27]
[null,185,20067,"0116511-53.2025.3.00.0000","2025-04-02","2025-08-01","MS 6.019/DF","1998-10-22","Administrativo - Servidor Público Civil - Sistema Remuneratório e Benefícios","2007-12-10","Instituto Nacional do Seguro Social – INSS","Instituto Nacional do Seguro Social - INSS","Reajuste Salarial - Resíduo de 3,17%","Dedução de Honorários Contratuais","Alimentar","Não","Não","Não","-","-","Não informada","Não Informada","NÃO",56308.72,3660.06,0,0,0,52648.66,0,0,0,43,21558.9,0,58582.57,3807.86,0,0,0,54774.71,0,0,0,22429.49,0]
[null,186,20068,"0116521-97.2025.3.00.0000","2025-04-02","2025-08-01","MS 6.019/DF","1998-10-22","Administrativo - Servidor Público Civil - Sistema Remuneratório e Benefícios","2007-12-10","Instituto Nacional do Seguro Social – INSS","Instituto Nacional do Seguro Social - INSS","Reajuste Salarial - Resíduo de 3,17%","Dedução de Honorários Contratuais","Alimentar","Não","Não","Não","-","-","Não informada","Não Informada","NÃO",864.64,56.2,0,0,0,808.44,388.49,42.73,85.46,4,332.29,42.73,899.54,58.47,0,0,0,841.07,404.17,44.45,88.9,345.7,44.45]
[null,187,20069,"0116532-29.2025.3.00.0000","2025-04-02","2025-08-01","MS 6.019/DF","1998-10-22","Administrativo - Servidor Público Civil - Sistema Remuneratório e Benefícios","2007-12-10","Instituto Nacional do Seguro Social – INSS","Instituto Nacional do Seguro Social - INSS","Reajuste Salarial - Resíduo de 3,17%","Dedução de Honorários Contratuais","Alimentar","Não","Não","Não","-","-","Não informada","Não Informada","NÃO",55722.39,3621.95,0,0,0,52100.44,25469.64,2801.65,5603.3,43,21847.69,2801.65,57972.56,3768.21,0,0,0,54204.35,26498.15,2914.79,5829.58,22729.94,2914.79]
[null,188,20071,"0116537-51.2025.3.00.0000","2025-04-02","2025-08-01","MS 6.019/DF","1998-10-22","Administrativo - Servidor Público Civil - Sistema Remuneratório e Benefícios","2007-12-10","Instituto Nacional do Seguro Social – INSS","Instituto Nacional do Seguro Social - INSS","Reajuste Salarial - Resíduo de 3,17%","Dedução de Honorários Contratuais","Alimentar","Não","Não","Não","-","-","Não informada","Não Informada","NÃO",24468.85,1590.47,0,0,0,22878.38,10578.88,1163.67,2327.34,25,8988.41,1163.67,25456.94,1654.7,0,0,0,23802.240000000002,11006.07,1210.6600000000001,2421.3200000000002,9351.3700000000008,1210.6600000000001]
[null,189,20073,"0116578-18.2025.3.00.0000","2025-04-02","2025-08-01","MS 6.019/DF","1998-10-22","Administrativo - Servidor Público Civil - Sistema Remuneratório e Benefícios","2007-12-10","Instituto Nacional do Seguro Social – INSS","Instituto Nacional do Seguro Social - INSS","Reajuste Salarial - Resíduo de 3,17%","Dedução de Honorários Contratuais","Alimentar","Não","Não","Não","-","-","Não informada","Não Informada","NÃO",24752.04,1608.88,0,0,0,23143.16,10716.88,1178.8499999999999,2357.6999999999998,24,9108,1178.8499999999999,25751.56,1673.85,0,0,0,24077.71,11149.64,1226.46,2452.92,9475.7900000000009,1226.46]
[null,190,20074,"0116586-92.2025.3.00.0000","2025-04-02","2025-08-01","MS 6.019/DF","1998-10-22","Administrativo - Servidor Público Civil - Sistema Remuneratório e Benefícios","2007-12-10","Instituto Nacional do Seguro Social – INSS","Instituto Nacional do Seguro Social - INSS","Reajuste Salarial - Resíduo de 3,17%","Dedução de Honorários Contratuais","Alimentar","Não","Não","Não","-","-","Não informada","Não Informada","NÃO",43747.6,2843.59,0,0,0,40904.01,0,0,0,43,17158.150000000001,0,45514.2,2958.42,0,0,0,42555.78,0,0,0,17851.02,0]
[null,191,20075,"0116952-34.2025.3.00.0000","2025-04-02","2025-08-01","MS 6.864/DF","2000-04-05","Administrativo - Servidor Público Civil - Sistema Remuneratório e Benefícios","2006-05-03","Instituto Nacional do Seguro Social – INSS","-","Multa 1% (art. 538,parágrafo único, do CPC)","x.x.x","Comum","Não","Não","Não","-","-","Não informada","Não Informada","NÃO",320.14999999999998,0,0,0,0,320.14999999999998,0,0,0,0,0,0,333.07,0,0,0,0,333.07,0,0,0,0,0]
[null,192,20077,"0144441-46.2025.3.00.0000","2025-04-24","2025-08-01","MS 4.151/DF","1995-07-21","Administrativo - Servidor Público Civil - Reajustes de Remuneração, Proventos ou Pensão","1999-02-12","União","Ministério da Fazenda","Diferença de remuneração - 3,17%","Dedução de Honorários Contratuais","Alimentar","Não","Não","Não","-","-","Não informada","Não Informada","NÃO",90827.62,5449.65,908.27,908.27,0,83561.429999999993,0,0,0,53,26264.5,0,93838.76,5630.32,938.38,938.38,0,86331.68,0,0,0,27135.23,0]
[null,193,20078,"0144470-96.2025.3.00.0000","2025-04-24","2025-08-01","MS 3.557/DF","1994-07-06","Administrativo - Servidor Público Civil - Reajustes de Remuneração, Proventos ou Pensão - Índice de 28,86% Lei 8.622/1993 e 8.627/1993","2004-08-09","União","Ministério da Defesa","Reajuste  28,86% ","Dedução de Honorários Contratuais","Alimentar","Não","Não","Não","-","-","Não informada","Não Informada","NÃO",86744.960000000006,17348.990000000002,0,0,0,69395.97,0,0,0,52,18761,0,89620.75,17924.150000000001,0,0,0,71696.600000000006,0,0,0,19382.97,0]
[null,194,20079,"0144472-66.2025.3.00.0000","2025-04-24","2025-08-01","MS 4.149/DF","1995-07-21","Administrativo - Servidor Público Civil - Sistema Remuneratório e Benefícios","1998-09-23","União","INCRA","Diferença de remuneração - 3,17%","Dedução de Honorários Contratuais","Alimentar","Não","Não","Não","-","-","Não informada","Não Informada","NÃO",2760.36,276.02999999999997,0,0,0,2484.33,0,0,0,0,0,0,2851.86,285.18,0,0,0,2566.6799999999998,0,0,0,0,0]
[null,{"$f":"IF(C205=\"\",\"\",B204+1)","v":195},20088,"0146213-44.2025.3.00.0000","2025-04-25","2025-08-01","MS 10.438/DF","2005-02-22","Administrativo - Militar - Pensão","2007-09-13","União","Ministério da Fazenda","Soldo previsto na Lei Estadual 1.063/2002","Dedução de Honorários Contratuais","Alimentar","Não","Não","Não","-","-","Não informada","Não Informada","NÃO",22150.73,4540.8900000000003,2325.8200000000002,0,0,15284.02,0,0,0,19,10480.049999999999,0,22885.07,4691.43,2402.9299999999998,0,0,15790.71,0,0,0,10827.48,0]
[null,196,20089,"0146215-14.2025.3.00.0000","2025-04-25","2025-08-01","MS 8.468/DF","2002-07-10","Administrativo - Servidor Público Civil - Regime Estatutário - Enquadramento (PRINCIPAL)","2002-12-04","União","-","Honorários de sucumbência","x.x.x","Alimentar","Não","Não","Não","-","-","Não informada","Não Informada","NÃO",6360.62,0,0,0,0,6360.62,0,0,0,0,0,0,6712.99,0,0,0,0,6712.99,0,0,0,0,0]
[null,197,20090,"0146264-55.2025.3.00.0000","2025-04-25","2025-08-01","MS 6.040/DF","1998-11-16","Administrativo - Servidor Público Civil - Sistema Remuneratório e Benefícios (PRINCIPAL)","2003-10-01","União","Superintendência de Seguros Privados - SUSEP","Incorporação da diferença de 3,17%","Dedução de Honorários Contratuais","Alimentar","Não","Não","Não","-","-","Não informada","Não Informada","NÃO",18726.71,936.33,936.33,0,0,16854.05,15349.88,1688.48,3376.96,42,6116.91,1688.48,19347.54,967.37,967.37,0,0,17412.8,16052.9,1765.81,3531.62,6319.7,1765.81]
[null,198,20091,"0146265-40.2025.3.00.0000","2025-04-25","2025-08-01","MS 6.040/DF","1998-11-16","Administrativo - Servidor Público Civil - Sistema Remuneratório e Benefícios (PRINCIPAL)","2003-10-01","União","Superintendência de Seguros Privados - SUSEP","Incorporação da diferença de 3,17%","Dedução de Honorários Contratuais","Alimentar","Não","Não","Não","-","-","Não informada","Não Informada","NÃO",12965.78,648.28,648.28,0,0,11669.22,0,0,0,42,3766.59,0,13395.62,669.78,669.78,0,0,12056.06,0,0,0,3891.44,0]
[null,199,20092,"0146277-54.2025.3.00.0000","2025-04-25","2025-08-01","MS 6.040/DF","1998-11-16","Administrativo - Servidor Público Civil - Sistema Remuneratório e Benefícios (PRINCIPAL)","2003-10-01","União","Superintendência de Seguros Privados - SUSEP","Incorporação da diferença de 3,17%","Dedução de Honorários Contratuais","Alimentar","Não","Não","Não","-","-","Não informada","Não Informada","NÃO",19422.3,971.11,971.11,0,0,17480.080000000002,15569.65,1712.66,3425.32,42,6387.81,1712.66,20066.189999999999,1003.3,1003.3,0,0,18059.59,16282.73,1791.1,3582.2,6599.59,1791.1]
[null,200,20093,"0146279-24.2025.3.00.0000","2025-04-25","2025-08-01","MS 6.040/DF","1998-11-16","Administrativo - Servidor Público Civil - Sistema Remuneratório e Benefícios (PRINCIPAL)","2003-10-01","União","Superintendência de Seguros Privados - SUSEP","Incorporação da diferença de 3,17%","Dedução de Honorários Contratuais","Alimentar","Não","Não","Não","-","-","Não informada","Não Informada","NÃO",5161.16,258.05,258.05,0,0,4645.0600000000004,6101.33,671.14,1342.28,42,1362.43,671.14,5332.25,266.61,266.61,0,0,4799.03,6380.77,701.88,1403.76,1407.58,701.88]
[null,201,20094,"0146284-46.2025.3.00.0000","2025-04-25","2025-08-01","MS 6.040/DF","1998-11-16","Administrativo - Servidor Público Civil - Sistema Remuneratório e Benefícios (PRINCIPAL)","2003-10-01","União","Superintendência de Seguros Privados - SUSEP","Incorporação da diferença de 3,17%","Dedução de Honorários Contratuais","Alimentar","Não","Não","Não","-","-","Não informada","Não Informada","NÃO",7765.64,388.28,388.28,0,0,6989.08,10178.1,1119.5899999999999,2239.1799999999998,42,1896.09,1119.5899999999999,8023.08,401.15,401.15,0,0,7220.78,10644.25,1170.8599999999999,2341.7199999999998,1958.95,1170.8599999999999]
[null,202,20095,"0146285-31.2025.3.00.0000","2025-04-25","2025-08-01","MS 6.040/DF","1998-11-16","Administrativo - Servidor Público Civil - Sistema Remuneratório e Benefícios (PRINCIPAL)","2003-10-01","União","Superintendência de Seguros Privados - SUSEP","Incorporação da diferença de 3,17%","Dedução de Honorários Contratuais","Alimentar","Não","Não","Não","-","-","Não informada","Não Informada","NÃO",10339.08,516.95000000000005,516.95000000000005,0,0,9305.18,9083.07,999.13,1998.26,42,3238.4,999.13,10681.83,534.09,534.09,0,0,9613.65,9499.07,1044.8900000000001,2089.7800000000002,3345.75,1044.8900000000001]
[null,203,20096,"0146287-98.2025.3.00.0000","2025-04-25","2025-08-01","MS 6.040/DF","1998-11-16","Administrativo - Servidor Público Civil - Sistema Remuneratório e Benefícios (PRINCIPAL)","2003-10-01","União","Superintendência de Seguros Privados - SUSEP","Incorporação da diferença de 3,17%","Dedução de Honorários Contratuais","Alimentar","Não","Não","Não","-","-","Não informada","Não Informada","NÃO",6237.55,311.87,311.87,0,0,5613.81,0,0,0,42,1475.67,0,6444.33,322.20999999999998,322.20999999999998,0,0,5799.91,0,0,0,1524.59,0]
[null,204,20097,"0146293-08.2025.3.00.0000","2025-04-25","2025-08-01","MS 6.040/DF","1998-11-16","Administrativo - Servidor Público Civil - Sistema Remuneratório e Benefícios (PRINCIPAL)","2003-10-01","União","Superintendência de Seguros Privados - SUSEP","Incorporação da diferença de 3,17%","Dedução de Honorários Contratuais","Alimentar","Não","Não","Não","-","-","Não informada","Não Informada","NÃO",5066.41,253.32,253.32,0,0,4559.7700000000004,7306.87,803.75,1607.5,42,1149.07,803.75,5234.37,261.70999999999998,261.70999999999998,0,0,4710.95,7641.52,840.56,1681.12,1187.18,840.56]
[null,205,20098,"0146296-60.2025.3.00.0000","2025-04-25","2025-08-01","MS 6.040/DF","1998-11-16","Administrativo - Servidor Público Civil - Sistema Remuneratório e Benefícios (PRINCIPAL)","2003-10-01","União","Superintendência de Seguros Privados - SUSEP","Incorporação da diferença de 3,17%","Dedução de Honorários Contratuais","Alimentar","Não","Não","Não","-","-","Não informada","Não Informada","NÃO",25612.3,1280.6099999999999,1280.6099999999999,0,0,23051.08,0,0,0,42,7410.13,0,26461.4,1323.07,1323.07,0,0,23815.26,0,0,0,7655.78,0]
[null,206,20099,"0146300-97.2025.3.00.0000","2025-04-25","2025-08-01","MS 6.040/DF","1998-11-16","Administrativo - Servidor Público Civil - Sistema Remuneratório e Benefícios (PRINCIPAL)","2003-10-01","União","Superintendência de Seguros Privados - SUSEP","Incorporação da diferença de 3,17%","Dedução de Honorários Contratuais","Alimentar","Não","Não","Não","-","-","Não informada","Não Informada","NÃO",7708.2,385.41,385.41,0,0,6937.38,10158.290000000001,1117.4100000000001,2234.8200000000002,42,1885.53,1117.4100000000001,7963.74,398.18,398.18,0,0,7167.38,10623.53,1168.58,2337.16,1948.05,1168.58]
[null,207,20100,"0146322-58.2025.3.00.0000","2025-04-25","2025-08-01","MS 6.040/DF","1998-11-16","Administrativo - Servidor Público Civil - Sistema Remuneratório e Benefícios (PRINCIPAL)","2003-10-01","União","Superintendência de Seguros Privados - SUSEP","Incorporação da diferença de 3,17%","Dedução de Honorários Contratuais","Alimentar","Não","Não","Não","-","-","Não informada","Não Informada","NÃO",5815.48,290.77,290.77,0,0,5233.9399999999996,7609.35,837.02,1674.04,42,1425.76,837.02,6008.27,300.41000000000003,300.41000000000003,0,0,5407.45,7957.85,875.36,1750.72,1473.02,875.36]
[null,208,20101,"0146323-43.2025.3.00.0000","2025-04-25","2025-08-01","MS 6.040/DF","1998-11-16","Administrativo - Servidor Público Civil - Sistema Remuneratório e Benefícios (PRINCIPAL)","2003-10-01","União","Superintendência de Seguros Privados - SUSEP","Incorporação da diferença de 3,17%","Dedução de Honorários Contratuais","Alimentar","Não","Não","Não","-","-","Não informada","Não Informada","NÃO",16580.400000000001,829.02,829.02,0,0,14922.36,0,0,0,42,5099.08,0,17130.07,856.5,856.5,0,0,15417.07,0,0,0,5268.13,0]
[null,209,20102,"0146324-28.2025.3.00.0000","2025-04-25","2025-08-01","MS 6.040/DF","1998-11-16","Administrativo - Servidor Público Civil - Sistema Remuneratório e Benefícios (PRINCIPAL)","2003-10-01","União","Superintendência de Seguros Privados - SUSEP","Incorporação da diferença de 3,17%","Dedução de Honorários Contratuais","Alimentar","Não","Não","Não","-","-","Não informada","Não Informada","NÃO",8142.95,407.14,407.14,0,0,7328.67,9597.76,1055.75,2111.5,42,2019.53,1055.75,8412.9,420.64,420.64,0,0,7571.62,10037.33,1104.0999999999999,2208.1999999999998,2086.4699999999998,1104.0999999999999]
[null,210,20103,"0146325-13.2025.3.00.0000","2025-04-25","2025-08-01","MS 6.040/DF","1998-11-16","Administrativo - Servidor Público Civil - Sistema Remuneratório e Benefícios (PRINCIPAL)","2003-10-01","União","Superintendência de Seguros Privados - SUSEP","Incorporação da diferença de 3,17%","Dedução de Honorários Contratuais","Alimentar","Não","Não","Não","-","-","Não informada","Não Informada","NÃO",9509,475.45,475.45,0,0,8558.1,11557.54,1271.32,2542.64,42,2476.5100000000002,1271.32,9824.23,491.21,491.21,0,0,8841.81,12086.87,1329.55,2659.1,2558.61,1329.55]
[null,211,20104,"0146326-95.2025.3.00.0000","2025-04-25","2025-08-01","MS 6.040/DF","1998-11-16","Administrativo - Servidor Público Civil - Sistema Remuneratório e Benefícios (PRINCIPAL)","2003-10-01","União","Superintendência de Seguros Privados - SUSEP","Incorporação da diferença de 3,17%","Dedução de Honorários Contratuais","Alimentar","Não","Não","Não","-","-","Não informada","Não Informada","NÃO",7674.48,383.72,383.72,0,0,6907.04,0,0,0,42,2161.54,0,7928.9,396.44,396.44,0,0,7136.02,0,0,0,2233.1999999999998,0]
[null,212,20105,"0146330-35.2025.3.00.0000","2025-04-25","2025-08-01","MS 6.040/DF","1998-11-16","Administrativo - Servidor Público Civil - Sistema Remuneratório e Benefícios (PRINCIPAL)","2003-10-01","União","Superintendência de Seguros Privados - SUSEP","Incorporação da diferença de 3,17%","Dedução de Honorários Contratuais","Alimentar","Não","Não","Não","-","-","Não informada","Não Informada","NÃO",6673.79,333.68,333.68,0,0,6006.43,7224.98,794.74,1589.48,42,1897.78,794.74,6895.04,344.75,344.75,0,0,6205.54,7555.88,831.14,1662.28,1960.68,831.14]
[null,213,20106,"0146332-05.2025.3.00.0000","2025-04-25","2025-08-01","MS 6.040/DF","1998-11-16","Administrativo - Servidor Público Civil - Sistema Remuneratório e Benefícios (PRINCIPAL)","2003-10-01","União","Superintendência de Seguros Privados - SUSEP","Incorporação da diferença de 3,17%","Dedução de Honorários Contratuais","Alimentar","Não","Não","Não","-","-","Não informada","Não Informada","NÃO",14954.8,747.74,747.74,0,0,13459.32,14744.91,1621.94,3243.88,42,4376.0600000000004,1621.94,15450.58,772.52,772.52,0,0,13905.54,15420.22,1696.22,3392.44,4521.1499999999996,1696.22]
[null,214,20107,"0146334-72.2025.3.00.0000","2025-04-25","2025-08-01","MS 6.040/DF","1998-11-16","Administrativo - Servidor Público Civil - Sistema Remuneratório e Benefícios (PRINCIPAL)","2003-10-01","União","Superintendência de Seguros Privados - SUSEP","Incorporação da diferença de 3,17%","Dedução de Honorários Contratuais","Alimentar","Não","Não","Não","-","-","Não informada","Não Informada","NÃO",7887.48,394.37,394.37,0,0,7098.74,9569.56,1052.6500000000001,2105.3000000000002,42,2186.37,1052.6500000000001,8148.96,407.44,407.44,0,0,7334.08,10007.84,1100.8599999999999,2201.7199999999998,2258.86,1100.8599999999999]
[null,215,20108,"0146337-27.2025.3.00.0000","2025-04-25","2025-08-01","MS 6.040/DF","1998-11-16","Administrativo - Servidor Público Civil - Sistema Remuneratório e Benefícios (PRINCIPAL)","2003-10-01","União","Superintendência de Seguros Privados - SUSEP","Incorporação da diferença de 3,17%","Dedução de Honorários Contratuais","Alimentar","Não","Não","Não","-","-","Não informada","Não Informada","NÃO",23078.98,1153.94,1153.94,0,0,20771.099999999999,343.93,37.83,75.66,42,7173.14,37.83,23844.09,1192.2,1192.2,0,0,21459.69,359.68,39.56,79.12,7410.93,39.56]
[null,216,20109,"0146362-40.2025.3.00.0000","2025-04-25","2025-08-01","MS 6.040/DF","1998-11-16","Administrativo - Servidor Público Civil - Sistema Remuneratório e Benefícios (PRINCIPAL)","2003-10-01","União","Superintendência de Seguros Privados - SUSEP","Incorporação da diferença de 3,17%","Dedução de Honorários Contratuais","Alimentar","Não","Não","Não","-","-","Não informada","Não Informada","NÃO",2796.82,139.84,139.84,0,0,2517.14,0,0,0,42,177.77,0,2889.53,144.47,144.47,0,0,2600.59,0,0,0,183.67,0]
[null,217,20118,"0151558-88.2025.3.00.0000","2025-04-29","2025-08-01","MS 26.833/DF","2020-09-03","Administrativo - Militar - Regime - Anistia Política","2021-10-22","União","Ministério da Mulher, da Família e dos Direitos Humanos","Anistia Política - Reparação Econômica","Dedução de Honorários Contratuais","Comum","Não","Não","Não","-","-","Não informada","Não Informada","SIM",14555.53,2183.3200000000002,0,0,0,12372.21,0,0,0,0,0,0,15038.07,2255.71,0,0,0,12782.36,0,0,0,0,0]
[null,218,20119,"0151564-95.2025.3.00.0000","2025-04-29","2025-08-01","MS 6.040/DF","1998-11-16","Administrativo - Servidor Público Civil - Sistema Remuneratório e Benefícios (PRINCIPAL)","2003-10-01","União","Superintendência de Seguros Privados - SUSEP","Incorporação da diferença de 3,17%","Dedução de Honorários Contratuais","Alimentar","Não","Não","Não","-","-","Não informada","Não Informada","NÃO",6034.56,301.72000000000003,301.72000000000003,0,0,5431.12,0,0,0,42,1494.6,0,6234.61,311.73,311.73,0,0,5611.15,0,0,0,1544.13,0]
[null,219,20120,"0151571-87.2025.3.00.0000","2025-04-29","2025-08-01","MS 6.040/DF","1998-11-16","Administrativo - Servidor Público Civil - Sistema Remuneratório e Benefícios (PRINCIPAL)","2003-10-01","União","Superintendência de Seguros Privados - SUSEP","Incorporação da diferença de 3,17%","Dedução de Honorários Contratuais","Alimentar","Não","Não","Não","-","-","Não informada","Não Informada","NÃO",7865.26,393.26,393.26,0,0,7078.74,10179.25,1119.71,2239.42,42,1948.3,1119.71,8126,406.3,406.3,0,0,7313.4,10645.45,1170.99,2341.98,2012.88,1170.99]
[null,220,20121,"0151574-42.2025.3.00.0000","2025-04-29","2025-08-01","MS 6.040/DF","1998-11-16","Administrativo - Servidor Público Civil - Sistema Remuneratório e Benefícios (PRINCIPAL)","2003-10-01","União","Superintendência de Seguros Privados - SUSEP","Incorporação da diferença de 3,17%","Dedução de Honorários Contratuais","Alimentar","Não","Não","Não","-","-","Não informada","Não Informada","NÃO",18277.73,913.88,913.88,0,0,16449.97,16633.77,1829.71,3659.42,42,5701.63,1829.71,18883.669999999998,944.18,944.18,0,0,16995.310000000001,17395.59,1913.51,3827.02,5890.64,1913.51]
[null,221,20122,"0151575-27.2025.3.00.0000","2025-04-29","2025-08-01","MS 6.040/DF","1998-11-16","Administrativo - Servidor Público Civil - Sistema Remuneratório e Benefícios (PRINCIPAL)","2003-10-01","União","Superintendência de Seguros Privados - SUSEP","Incorporação da diferença de 3,17%","Dedução de Honorários Contratuais","Alimentar","Não","Não","Não","-","-","Não informada","Não Informada","NÃO",4927.54,246.37,246.37,0,0,4434.8,7128.01,784.08,1568.16,42,1131.79,784.08,5090.8900000000003,254.54,254.54,0,0,4581.8100000000004,7454.47,819.99,1639.98,1169.3,819.99]
[null,222,20123,"0151578-79.2025.3.00.0000","2025-04-29","2025-08-01","MS 6.040/DF","1998-11-16","Administrativo - Servidor Público Civil - Sistema Remuneratório e Benefícios (PRINCIPAL)","2003-10-01","União","Superintendência de Seguros Privados - SUSEP","Incorporação da diferença de 3,17%","Dedução de Honorários Contratuais","Alimentar","Não","Não","Não","-","-","Não informada","Não Informada","NÃO",2488.9299999999998,124.44,124.44,0,0,2240.0500000000002,0,0,0,42,648.69000000000005,0,2571.4299999999998,128.57,128.57,0,0,2314.29,0,0,0,670.18,0]
[null,223,20124,"0151579-64.2025.3.00.0000","2025-04-29","2025-08-01","MS 6.040/DF","1998-11-16","Administrativo - Servidor Público Civil - Sistema Remuneratório e Benefícios (PRINCIPAL)","2003-10-01","União","Superintendência de Seguros Privados - SUSEP","Incorporação da diferença de 3,17%","Dedução de Honorários Contratuais","Alimentar","Não","Não","Não","-","-","Não informada","Não Informada","NÃO",6916.32,345.81,345.81,0,0,6224.7,0,0,0,42,1787.87,0,7145.61,357.28,357.28,0,0,6431.05,0,0,0,1847.13,0]
[null,224,20125,"0151581-34.2025.3.00.0000","2025-04-29","2025-08-01","MS 6.040/DF","1998-11-16","Administrativo - Servidor Público Civil - Sistema Remuneratório e Benefícios (PRINCIPAL)","2003-10-01","União","Superintendência de Seguros Privados - SUSEP","Incorporação da diferença de 3,17%","Dedução de Honorários Contratuais","Alimentar","Não","Não","Não","-","-","Não informada","Não Informada","NÃO",11954.33,597.71,597.71,0,0,10758.91,9468.4599999999991,1041.53,2083.06,42,3887.89,1041.53,12350.64,617.53,617.53,0,0,11115.58,9902.11,1089.23,2178.46,4016.77,1089.23]
[null,225,20135,"0151641-07.2025.3.00.0000","2025-04-29","2025-08-01","MS 4.151/DF","1995-07-21","Administrativo - Servidor Público Civil - Reajustes de Remuneração, Proventos ou Pensão","1999-02-12","União","Ministério da Fazenda","Diferença de remuneração - 3,17%","Dedução de Honorários Contratuais","Alimentar","Não","Não","Não","-","-","Não informada","Não Informada","NÃO",91080,5464.8,910.8,910.8,1821.6,81972,0,0,0,53,24321.87,0,94099.5,5645.97,940.99,940.99,1881.99,84689.56,0,0,0,25128.2,0]
[null,226,20141,"0170211-41.2025.3.00.0000","2025-05-13","2025-08-01","MS 10.424/DF","2005-02-17","Administrativo - Servidor Público Civil - Sistema Remuneratório e Benefícios - Gratificações","2005-10-27","União","Ministério do Planejamento, Orçamento e Gestão","Gratificação Específica de Atividade Docente - GEAD","Dedução de Honorários Contratuais","Alimentar","Não","Não","Não","-","-","Não informada","Não Informada","NÃO",8648.9500000000007,951.38,0,0,0,7697.57,4360.34,479.63,959.26,9,3408.96,479.63,8867.6299999999992,975.43,0,0,0,7892.2,4470.59,491.76,983.52,3495.16,491.76]
[null,227,20142,"0170213-11.2025.3.00.0000","2025-05-13","2025-08-01","MS 10.424/DF","2005-02-17","Administrativo - Servidor Público Civil - Sistema Remuneratório e Benefícios - Gratificações","2005-10-27","União","Ministério do Planejamento, Orçamento e Gestão","Gratificação Específica de Atividade Docente - GEAD","Dedução de Honorários Contratuais","Alimentar","Não","Não","Não","-","-","Não informada","Não Informada","NÃO",17140.04,1885.4,0,0,0,15254.64,9163.83,1008.02,2016.04,9,7278.43,1008.02,17573.43,1933.07,0,0,0,15640.36,9395.5400000000009,1033.5,2067,7462.47,1033.5]
[null,228,20177,"0172436-34.2025.3.00.0000","2025-05-14","2025-08-01","MS 10.424/DF","2005-02-17","Administrativo - Servidor Público Civil - Sistema Remuneratório e Benefícios - Gratificações","2005-10-27","União","Ministério do Planejamento, Orçamento e Gestão","Gratificação Específica de Atividade Docente - GEAD","Dedução de Honorários Contratuais","Alimentar","Não","Não","Não","-","-","Não informada","Não Informada","NÃO",30672.21,3373.94,0,0,0,27298.27,16354.2,1798.96,0,7,12980.26,1798.96,31447.759999999998,3459.25,0,0,0,27988.51,16767.72,1844.44,0,13308.47,1844.44]
[null,229,20178,"0172438-04.2025.3.00.0000","2025-05-14","2025-08-01","MS 10.424/DF","2005-02-17","Administrativo - Servidor Público Civil - Sistema Remuneratório e Benefícios - Gratificações","2005-10-27","União","Ministério do Planejamento, Orçamento e Gestão","Gratificação Específica de Atividade Docente - GEAD","Dedução de Honorários Contratuais","Alimentar","Não","Não","Não","-","-","Não informada","Não Informada","NÃO",10031.15,1103.42,0,0,0,8927.73,5407.62,594.83000000000004,0,3,4304.2,594.83000000000004,10284.780000000001,1131.32,0,0,0,9153.4599999999991,5544.35,609.87,0,4413.03,609.87]
[null,230,20179,"0172443-26.2025.3.00.0000","2025-05-14","2025-08-01","MS 10.424/DF","2005-02-17","Administrativo - Servidor Público Civil - Sistema Remuneratório e Benefícios - Gratificações","2005-10-27","União","Ministério do Planejamento, Orçamento e Gestão","Gratificação Específica de Atividade Docente - GEAD","Dedução de Honorários Contratuais","Alimentar","Não","Não","Não","-","-","Não informada","Não Informada","NÃO",17139.97,1885.39,0,0,0,15254.58,9163.81,1008.01,2016.02,9,7278.42,1008.01,17573.36,1933.06,0,0,0,15640.3,9395.52,1033.5,2067,7462.46,1033.5]
[null,231,20180,"0172468-39.2025.3.00.0000","2025-05-14","2025-08-01","MS 10.424/DF","2005-02-17","Administrativo - Servidor Público Civil - Sistema Remuneratório e Benefícios - Gratificações","2005-10-27","União","Ministério do Planejamento, Orçamento e Gestão","Gratificação Específica de Atividade Docente - GEAD","Dedução de Honorários Contratuais","Alimentar","Não","Não","Não","-","-","Não informada","Não Informada","NÃO",17139.97,1885.39,0,0,0,15254.58,9163.81,1008.01,2016.02,9,7278.42,1008.01,17573.36,1933.06,0,0,0,15640.3,9395.52,1033.5,2067,7462.46,1033.5]
[null,232,20181,"0172479-68.2025.3.00.0000","2025-05-14","2025-08-01","MS 30.092/DF","2024-03-18","Administrativo - Militar - Regime - Anistia Política (PRINCIPAL)","2024-08-23","União","Ministério da Mulher, da Família e dos Direitos Humanos","Anistia Política - Reparação Econômica","x.x.x","Comum","Não","Não","Não","-","-","Não informada","Não Informada","SIM",78950.38,0,0,0,0,78950.38,0,0,0,0,0,0,81598.350000000006,0,0,0,0,81598.350000000006,0,0,0,0,0]
[null,233,20183,"0172499-59.2025.3.00.0000","2025-05-14","2025-08-01","MS 26.799/DF","2020-08-26","Administrativo - Militar - Regime - Anistia Política","2021-10-22","União","Ministério da Mulher, da Família e dos Direitos Humanos","Anistia Política - Reparação Econômica","x.x.x","Comum","Não","Não","Não","-","-","Não informada","Não Informada","SIM",77396.539999999994,0,0,0,0,77396.539999999994,0,0,0,0,0,0,79871.42,0,0,0,0,79871.42,0,0,0,0,0]
[null,234,20184,"0172516-95.2025.3.00.0000","2025-05-14","2025-08-01","MS 10.424/DF","2005-02-17","Administrativo - Servidor Público Civil - Sistema Remuneratório e Benefícios - Gratificações","2005-10-27","União","Ministério do Planejamento, Orçamento e Gestão","Gratificação Específica de Atividade Docente - GEAD","Dedução de Honorários Contratuais","Alimentar","Não","Não","Não","-","-","Não informada","Não Informada","NÃO",40703.32,4477.3599999999997,0,0,0,36225.96,21761.83,2393.8000000000002,0,9,17284.47,2393.8000000000002,41732.51,4590.57,0,0,0,37141.94,22312.080000000002,2454.3200000000002,0,17721.509999999998,2454.3200000000002]
[null,235,20185,"0172546-33.2025.3.00.0000","2025-05-14","2025-08-01","MS 10.424/DF","2005-02-17","Administrativo - Servidor Público Civil - Sistema Remuneratório e Benefícios - Gratificações","2005-10-27","União","Ministério do Planejamento, Orçamento e Gestão","Gratificação Específica de Atividade Docente - GEAD","Dedução de Honorários Contratuais","Alimentar","Não","Não","Não","-","-","Não informada","Não Informada","NÃO",40703.32,4477.3599999999997,0,0,0,36225.96,21761.83,2393.8000000000002,0,9,17284.47,2393.8000000000002,41732.51,4590.57,0,0,0,37141.94,22312.080000000002,2454.3200000000002,0,17721.509999999998,2454.3200000000002]
[null,236,20186,"0172557-62.2025.3.00.0000","2025-05-14","2025-08-01","MS 10.424/DF","2005-02-17","Administrativo - Servidor Público Civil - Sistema Remuneratório e Benefícios - Gratificações","2005-10-27","União","Ministério do Planejamento, Orçamento e Gestão","Gratificação Específica de Atividade Docente - GEAD","Dedução de Honorários Contratuais","Alimentar","Não","Não","Não","-","-","Não informada","Não Informada","NÃO",40703.32,4477.3599999999997,0,0,0,36225.96,21761.83,2393.8000000000002,0,9,17284.47,2393.8000000000002,41732.51,4590.57,0,0,0,37141.94,22312.080000000002,2454.3200000000002,0,17721.509999999998,2454.3200000000002]
[null,237,20212,"0174119-09.2025.3.00.0000","2025-05-15","2025-08-01","MS 3.099/DF","1993-09-15","Administrativo - Servidor Público Civil - Reajustes de Remuneração, Proventos ou Pensão - Índice de 28,86% Lei 8.622/1993 e 8.627/1993","2000-06-07","União","Ministério da Saúde","Índice de 28,86% Lei 8.622/1993 e 8.627/1993","Dedução de Honorários Contratuais","Alimentar","Não","Não","Não","-","-","Não informada","Não Informada","NÃO",3531.36,353.13,0,0,0,3178.23,1018.14,111.99,223.98,63,843.64,111.99,3620.65,362.06,0,0,0,3258.59,1053.97,115.93,231.86,864.97,115.93]
[null,238,20225,"0181997-82.2025.3.00.0000","2025-05-21","2025-08-01","MS 4.146/DF","1995-07-17","Administrativo - Servidor Público Civil - Reajustes de Remuneração, Proventos ou Pensão","1999-10-15","União","Ministério da Fazenda","Reajuste  3,17% - Lei 8.880/94","Dedução de Honorários Contratuais","Alimentar","Não","Não","Não","-","-","Não informada","Não Informada","NÃO",12670.07,1900.51,0,0,0,10769.56,3869.68,425.66,851.32,85,1969.17,425.66,12990.43,1948.56,0,0,0,11041.87,3967.52,436.42,872.84,2018.96,436.42]
[null,239,20226,"0182021-13.2025.3.00.0000","2025-05-21","2025-08-01","MS 4.146/DF","1995-07-17","Administrativo - Servidor Público Civil - Reajustes de Remuneração, Proventos ou Pensão","1999-10-15","União","Ministério da Fazenda","Reajuste  3,17% - Lei 8.880/94","Dedução de Honorários Contratuais","Alimentar","Não","Não","Não","-","-","Não informada","Não Informada","NÃO",7169.26,1075.3800000000001,0,0,0,6093.88,0,0,0,0,0,0,7350.53,1102.57,0,0,0,6247.96,0,0,0,0,0]
[null,240,20227,"0182024-65.2025.3.00.0000","2025-05-21","2025-08-01","MS 4.146/DF","1995-07-17","Administrativo - Servidor Público Civil - Reajustes de Remuneração, Proventos ou Pensão","1999-10-15","União","Ministério da Fazenda","Reajuste  3,17% - Lei 8.880/94","Dedução de Honorários Contratuais","Alimentar","Não","Não","Não","-","-","Não informada","Não Informada","NÃO",20054.349999999999,3008.15,0,0,0,17046.2,6117.84,672.96,1345.92,85,3109.69,672.96,20561.43,3084.21,0,0,0,17477.22,6272.53,689.97,1379.94,3188.32,689.97]
[null,241,20228,"0182027-20.2025.3.00.0000","2025-05-21","2025-08-01","MS 4.146/DF","1995-07-17","Administrativo - Servidor Público Civil - Reajustes de Remuneração, Proventos ou Pensão","1999-10-15","União","Ministério da Fazenda","Reajuste  3,17% - Lei 8.880/94","Dedução de Honorários Contratuais","Alimentar","Não","Não","Não","-","-","Não informada","Não Informada","NÃO",35312.300000000003,5296.84,0,0,0,30015.46,11994.63,1319.4,2638.8,85,6697.79,1319.4,36205.19,5430.77,0,0,0,30774.42,12297.92,1352.77,2705.54,6867.15,1352.77]
[null,242,20229,"0182032-42.2025.3.00.0000","2025-05-21","2025-08-01","MS 4.146/DF","1995-07-17","Administrativo - Servidor Público Civil - Reajustes de Remuneração, Proventos ou Pensão","1999-10-15","União","Ministério da Fazenda","Reajuste  3,17% - Lei 8.880/94","Dedução de Honorários Contratuais","Alimentar","Não","Não","Não","-","-","Não informada","Não Informada","NÃO",14952.43,2242.86,0,0,0,12709.57,4481.63,492.97,985.94,85,2238.77,492.97,15330.5,2299.5700000000002,0,0,0,13030.93,4594.95,505.44,1010.88,2295.38,505.44]
[null,243,20230,"0182035-94.2025.3.00.0000","2025-05-21","2025-08-01","MS 4.146/DF","1995-07-17","Administrativo - Servidor Público Civil - Reajustes de Remuneração, Proventos ou Pensão","1999-10-15","União","Ministério da Fazenda","Reajuste  3,17% - Lei 8.880/94","Dedução de Honorários Contratuais","Alimentar","Não","Não","Não","-","-","Não informada","Não Informada","NÃO",22251.97,3337.79,0,0,0,18914.18,7245.25,796.97,1593.94,85,3907.46,796.97,22814.62,3422.19,0,0,0,19392.43,7428.45,817.12,1634.24,4006.26,817.12]
[null,244,20231,"0182043-71.2025.3.00.0000","2025-05-21","2025-08-01","MS 4.146/DF","1995-07-17","Administrativo - Servidor Público Civil - Reajustes de Remuneração, Proventos ou Pensão","1999-10-15","União","Ministério da Fazenda","Reajuste  3,17% - Lei 8.880/94","Dedução de Honorários Contratuais","Alimentar","Não","Não","Não","-","-","Não informada","Não Informada","NÃO",8596.5499999999993,1289.48,0,0,0,7307.07,0,0,0,85,1417.01,0,8813.91,1322.08,0,0,0,7491.83,0,0,0,1452.84,0]
[null,245,20232,"0182052-33.2025.3.00.0000","2025-05-21","2025-08-01","MS 4.146/DF","1995-07-17","Administrativo - Servidor Público Civil - Reajustes de Remuneração, Proventos ou Pensão","1999-10-15","União","Ministério da Fazenda","Reajuste  3,17% - Lei 8.880/94","Dedução de Honorários Contratuais","Alimentar","Não","Não","Não","-","-","Não informada","Não Informada","NÃO",19044.41,2856.66,0,0,0,16187.75,0,0,0,85,3127.19,0,19525.95,2928.89,0,0,0,16597.060000000001,0,0,0,3206.26,0]
[null,246,20233,"0182053-18.2025.3.00.0000","2025-05-21","2025-08-01","MS 4.146/DF","1995-07-17","Administrativo - Servidor Público Civil - Reajustes de Remuneração, Proventos ou Pensão","1999-10-15","União","Ministério da Fazenda","Reajuste  3,17% - Lei 8.880/94","Dedução de Honorários Contratuais","Alimentar","Não","Não","Não","-","-","Não informada","Não Informada","NÃO",19424.580000000002,2913.68,0,0,0,16510.900000000001,0,0,0,85,3222.92,0,19915.73,2987.35,0,0,0,16928.38,0,0,0,3304.41,0]
[null,247,20234,"0182086-08.2025.3.00.0000","2025-05-21","2025-08-01","MS 4.151/DF","1995-07-21","Administrativo - Servidor Público Civil - Reajustes de Remuneração, Proventos ou Pensão","1999-02-12","União","Ministério da Fazenda","Diferença de remuneração - 3,17%","Dedução de Honorários Contratuais","Alimentar","Não","Não","Não","-","-","Não informada","Não Informada","NÃO",90134.25,5408.05,901.34,901.34,0,82923.520000000004,39360.559999999998,4329.66,8659.32,53,25900.880000000001,4329.66,92413.33,5544.79,924.13,924.13,0,85020.28,40746.050000000003,4482.0600000000004,8964.1200000000008,26555.8,4482.0600000000004]
[null,248,20235,"0182092-15.2025.3.00.0000","2025-05-21","2025-08-01","MS 4.151/DF","1995-07-21","Administrativo - Servidor Público Civil - Reajustes de Remuneração, Proventos ou Pensão","1999-02-12","União","Ministério da Fazenda","Diferença de remuneração - 3,17%","Dedução de Honorários Contratuais","Alimentar","Não","Não","Não","-","-","Não informada","Não Informada","NÃO",79359.45,4761.5600000000004,793.59,793.59,0,73010.710000000006,41793.86,4597.32,9194.64,53,19779.57,4597.32,81366.080000000002,4881.96,813.66,813.66,0,74856.800000000003,43265,4759.1499999999996,9518.2999999999993,20279.689999999999,4759.1499999999996]
[null,249,20236,"0182098-22.2025.3.00.0000","2025-05-21","2025-08-01","MS 10.424/DF","2005-02-17","Administrativo - Servidor Público Civil - Sistema Remuneratório e Benefícios - Gratificações","2005-10-27","União","Ministério do Planejamento, Orçamento e Gestão","Gratificação Específica de Atividade Docente - GEAD","Dedução de Honorários Contratuais","Alimentar","Não","Não","Não","-","-","Não informada","Não Informada","NÃO",17139.900000000001,1885.38,0,0,0,15254.52,9163.7999999999993,1008.01,2016.02,9,7278.42,1008.01,17573.29,1933.06,0,0,0,15640.23,9395.51,1033.5,2067,7462.45,1033.5]
[null,250,20237,"0182100-89.2025.3.00.0000","2025-05-21","2025-08-01","MS 10.424/DF","2005-02-17","Administrativo - Servidor Público Civil - Sistema Remuneratório e Benefícios - Gratificações","2005-10-27","União","Ministério do Planejamento, Orçamento e Gestão","Gratificação Específica de Atividade Docente - GEAD","Dedução de Honorários Contratuais","Alimentar","Não","Não","Não","-","-","Não informada","Não Informada","NÃO",17139.900000000001,1885.38,0,0,0,15254.52,9163.7999999999993,1008.01,2016.02,9,7278.42,1008.01,17573.29,1933.06,0,0,0,15640.23,9395.51,1033.5,2067,7462.45,1033.5]
[null,251,20238,"0182103-44.2025.3.00.0000","2025-05-21","2025-08-01","MS 6.318/DF","1999-04-30","Administrativo - Servidor Público Civil - Reajustes de Remuneração, Proventos ou Pensão - Índice da URV Lei 8.880/1994","2003-02-17","União","Ministério da Fazenda","Reajuste 3,17%","Dedução de Honorários Contratuais","Alimentar","Não","Não","Não","-","-","Não informada","Não Informada","NÃO",22874.16,2744.89,0,0,0,20129.27,0,0,0,9,7063.6,0,23461.05,2815.32,0,0,0,20645.73,0,0,0,7244.83,0]
[null,252,20239,"0182113-88.2025.3.00.0000","2025-05-21","2025-08-01","MS 10.424/DF","2005-02-17","Administrativo - Servidor Público Civil - Sistema Remuneratório e Benefícios - Gratificações","2005-10-27","União","Ministério do Planejamento, Orçamento e Gestão","Gratificação Específica de Atividade Docente - GEAD","Dedução de Honorários Contratuais","Alimentar","Não","Não","Não","-","-","Não informada","Não Informada","NÃO",17067.84,1877.46,0,0,0,15190.38,9125.3799999999992,1003.79,2007.58,9,7248.22,1003.79,17499.400000000001,1924.93,0,0,0,15574.47,9446.59,1039.1199999999999,2078.2399999999998,7431.49,1039.1199999999999]
[null,253,20240,"0182148-48.2025.3.00.0000","2025-05-21","2025-08-01","MS 6.864/DF","2000-04-05","Administrativo - Servidor Público Civil - Sistema Remuneratório e Benefícios","2006-05-03","Instituto Nacional do Seguro Social – INSS","Ministério do Planejamento, Orçamento e Gestão","Reajuste  3,17% - Lei 8.880/94","Dedução de Honorários Contratuais","Alimentar","Não","Não","Não","-","-","Não informada","Não Informada","NÃO",40350.230000000003,4842.0200000000004,0,0,0,35508.21,0,0,0,40,12039.41,0,41370.5,4964.46,0,0,0,36406.04,0,0,0,12343.82,0]
[null,254,20241,"0182193-52.2025.3.00.0000","2025-05-21","2025-08-01","MS 4.151/DF","1995-07-21","Administrativo - Servidor Público Civil - Reajustes de Remuneração, Proventos ou Pensão","1999-02-12","União","Ministério da Fazenda","Diferença de remuneração - 3,17%","Dedução de Honorários Contratuais","Alimentar","Não","Não","Não","-","-","Não informada","Não Informada","NÃO",89353.13,5361.18,893.53,893.53,4467.6499999999996,77737.240000000005,0,0,0,53,20867.02,0,91612.46,5496.74,916.12,916.12,4580.62,79702.86,0,0,0,21394.65,0]
[null,255,20242,"0182336-41.2025.3.00.0000","2025-05-21","2025-08-01","MS 4.151/DF","1995-07-21","Administrativo - Servidor Público Civil - Reajustes de Remuneração, Proventos ou Pensão","1999-02-12","União","Ministério da Fazenda","Diferença de remuneração - 3,17%","Dedução de Honorários Contratuais","Alimentar","Não","Não","Não","-","-","Não informada","Não Informada","NÃO",87824.79,5269.48,878.24,878.24,0,80798.83,38750.43,4262.54,8525.08,52,24704.51,4262.54,90045.48,5402.72,900.45,900.45,0,82841.86,40114.44,4412.58,8825.16,25329.17,4412.58]
[null,256,20243,"0182644-77.2025.3.00.0000","2025-05-21","2025-08-01","MS 4.151/DF","1995-07-21","Administrativo - Servidor Público Civil - Reajustes de Remuneração, Proventos ou Pensão","1999-02-12","União","Ministério da Fazenda","Diferença de remuneração - 3,17%","Dedução de Honorários Contratuais","Alimentar","Não","Não","Não","-","-","Não informada","Não Informada","NÃO",85321.08,5119.26,853.21,853.21,0,78495.399999999994,38295.68,4212.5200000000004,8425.0400000000009,53,24164.47,4212.5200000000004,87478.46,5248.7,874.78,874.78,0,80480.2,39643.68,4360.8,8721.6,24775.49,4360.8]
[null,257,20245,"0182699-28.2025.3.00.0000","2025-05-21","2025-08-01","MS 10.438/DF","2005-02-22","Administrativo - Militar - Pensão","2007-09-13","União","Ministério da Fazenda","Soldo previsto na Lei Estadual 1.063/2002","Dedução de Honorários Contratuais","Alimentar","Não","Não","Não","-","-","Não informada","Não Informada","NÃO",34087.53,6987.94,3579.19,0,0,23520.400000000001,0,0,0,46,12220.95,0,34949.440000000002,7164.63,3669.69,0,0,24115.119999999999,0,0,0,12529.96,0]
[null,258,20248,"0190015-92.2025.3.00.0000","2025-05-26","2025-08-01","MS 4.151/DF","1995-07-21","Administrativo - Servidor Público Civil - Reajustes de Remuneração, Proventos ou Pensão","1999-02-12","União","Ministério da Fazenda","Diferença de remuneração - 3,17%","Dedução de Honorários Contratuais","Alimentar","Não","Não","Não","-","-","Não informada","Não Informada","NÃO",64850.65,3891.03,648.5,648.5,0,59662.62,38896.42,4278.6000000000004,8557.2000000000007,53,14270.87,4278.6000000000004,66490.42,3989.42,664.9,664.9,0,61171.199999999997,40265.57,4429.21,8858.42,14631.7,4429.21]
[null,{"$f":"IF(C269=\"\",\"\",B268+1)","v":259},20249,"0190017-62.2025.3.00.0000","2025-05-26","2025-08-01","MS 4.151/DF","1995-07-21","Administrativo - Servidor Público Civil - Reajustes de Remuneração, Proventos ou Pensão","1999-02-12","União","Ministério da Fazenda","Diferença de remuneração - 3,17%","Dedução de Honorários Contratuais","Alimentar","Não","Não","Não","-","-","Não informada","Não Informada","NÃO",65529.68,3931.78,655.29,655.29,0,60287.32,0,0,0,53,12817.77,0,67186.63,4031.19,671.86,671.86,0,61811.72,0,0,0,13141.88,0]
[null,260,20250,"0190020-17.2025.3.00.0000","2025-05-26","2025-08-01","MS 7.200/DF","2000-10-02","Administrativo - Anistia Administrativa","2005-11-22","União","Ministério de Minas e Energia","Anistia - Lei nº 8.878/94","Dedução de Honorários Contratuais","Alimentar","Não","Não","Não","-","-","Não informada","Não Informada","NÃO",23318.34,2331.83,0,0,0,20986.51,10228.93,1125.18,2045.78,2,11812.94,1125.18,24003.16,2400.31,0,0,0,21602.85,10588.98,1164.78,2117.79,12106.38,1164.78]
[null,261,20252,"0198333-64.2025.3.00.0000","2025-05-30","2025-08-01","MS 27.056/DF","2020-10-29","Administrativo - Militar - Regime - Anistia Política (PRINCIPAL)","2023-03-13","União","Ministério da Mulher, da Família e dos Direitos Humanos","Anistia Política - Reparação Econômica","x.x.x","Comum","Não","Não","Não","-","-","Não informada","Não Informada","SIM",91080,0,0,0,0,91080,0,0,0,0,0,0,94286.01,0,0,0,0,94286.01,0,0,0,0,0]
[null,262,20254,"0117172-32.2025.3.00.0000","2025-06-16","2025-08-01","MS 14.604/DF","2009-08-31","Administrativo - Militar - Regime - Anistia Política (PRINCIPAL)","2018-06-07","União","-","Honorários de sucumbência","x.x.x","Alimentar","Não","Não","Não","-","-","Não informada","Não Informada","NÃO",45540,0,0,0,0,45540,0,0,0,0,0,0,48062.91,0,0,0,0,48062.91,0,0,0,0,0]
[null,263,20255,"0117173-17.2025.3.00.0000","2025-06-16","2025-08-01","MS 14.604/DF","2009-08-31","Administrativo - Militar - Regime - Anistia Política (PRINCIPAL)","2018-06-07","União","-","Honorários de sucumbência","x.x.x","Alimentar","Não","Não","Não","-","-","Não informada","Não Informada","NÃO",45540,0,0,0,0,45540,0,0,0,0,0,0,48062.91,0,0,0,0,48062.91,0,0,0,0,0]
[null,{"$f":"IF(C274=\"\",\"\",#REF!+1)","v":""}]
[null,""]
[null,""]
[null,""]
[null,""]
[null,""]
[null,""]
[null,""]
[null,""]
[null,""]
[null,""]
[null,""]
[null,""]
[null,""]
[null,""]
[null,""]
[null,""]
[null,""]
[null,""]
[null,""]
[null,""]
[null,""]
[null,""]
[null,""]
[null,""]
[null,""]
[null,""]
[null,""]
[null,""]
[null,""]
[null,""]
[null,""]
[null,""]
[null,""]
[null,""]
[null,""]
[null,""]
[null,""]
[null,""]
[null,""]
[null,""]
[null,""]
[null,""]
[null,""]
[null,""]
[null,""]
[null,""]
[null,""]
[null,""]
[null,""]
[null,""]
[null,""]
[null,""]
[null,""]
[null,""]
[null,""]
[null,""]
[null,""]
[null,{"$f":"IF(C332=\"\",\"\",B331+1)","v":""}]
[null,""]
[null,""]
[null,""]
[null,""]
[null,""]
[null,""]
[null,""]
[null,""]
[null,""]
[null,""]
[null,""]
[null,""]
[null,""]
[null,""]
[null,""]
[null,""]
[null,""]
[null,""]
[null,""]
[null,""]
[null,""]
[null,""]
[null,""]
[null,""]
[null,""]
[null,""]
[null,""]
[null,""]
[null,""]
[null,""]
[null,""]
[null,""]
[null,""]
[null,""]
[null,""]
[null,""]
[null,""]
[null,""]
[null,""]
[null,""]
[null,""]
[null,""]
[null,""]
[null,""]
[null,""]
[null,""]
[null,""]
[null,""]
[null,""]
[null,""]
[null,""]
[null,""]
[null,""]
[null,""]
[null,""]
[null,""]
[null,""]
[null,""]
[null,""]
[null,""]
[null,""]
[null,""]
[null,""]
[null,{"$f":"IF(C396=\"\",\"\",B395+1)","v":""}]
[null,""]
[null,""]
[null,""]
[null,""]
[null,""]
[null,""]
[null,""]
[null,""]
[null,""]
[null,""]
[null,""]
[null,""]
[null,""]
[null,""]
[null,""]
[null,""]
[null,""]
[null,""]
[null,""]
[null,""]
[null,""]
[null,""]
[null,""]
[null,""]
[null,""]
[null,""]
[null,""]
[null,""]
[null,""]
[null,""]
[null,""]
[null,""]
[null,""]
[null,""]
[null,""]
[null,""]
[null,""]
[null,""]
[null,""]
[null,""]
[null,""]
[null,""]
[null,""]
[null,""]
[null,""]
[null,""]
[null,""]
[null,""]
[null,""]
[null,""]
[null,""]
[null,""]
[null,""]
[null,""]
[null,""]
[null,""]
[null,""]
[null,""]
[null,""]
[null,""]
[null,""]
[null,""]
[null,""]
[null,{"$f":"IF(C460=\"\",\"\",B459+1)","v":""}]
[null,""]
[null,""]
[null,""]
[null,""]
[null,""]
[null,""]
[null,""]
[null,""]
[null,""]
[null,""]
[null,""]
[null,""]
[null,""]
[null,""]
[null,""]
[null,""]
[null,""]
[null,""]
[null,""]
[null,""]
[null,""]
[null,""]
[null,""]
[null,""]
[null,""]
[null,""]
[null,""]
[null,""]
[null,""]
[null,""]
[null,""]
[null,""]
[null,""]
[null,""]
[null,""]
[null,""]
[null,""]
[null,""]
[null,""]
[null,""]
[null,""]
[null,""]
[null,""]
[null,""]
[null,""]
[null,""]
[null,""]
[null,""]
[null,""]
[]
[null,null,null,null,null,null,null,null,null,null,null,null,null,null,null,null,null,null,null,null,null,null,null,null,null,null,null,null,null,null,null,null,null,null,"Totais pagas",{"$f":"SUM(AJ11:AJ509)","v":8527338.4000000022},{"$f":"SUM(AK11:AK509)","v":717814.88999999966},144898.60000000006,22598.57,6462.61,{"$f":"SUM(AO11:AO509)","v":7635563.7300000014}]

{"sheet":"Guia 2","index":1,"n_rows":512,"n_cols":46,"rows_kept":512,"cut":false,"hidden":true,"merged":[[4,2,4,8],[5,4,5,7],[6,2,6,5],[6,6,6,9],[6,10,6,11],[7,19,8,19],[6,15,6,22],[6,23,6,34],[6,35,6,45],[7,2,8,2],[7,3,8,3],[7,4,8,4],[7,5,8,5],[7,6,8,6],[7,7,8,7],[7,8,8,8],[6,14,8,14],[7,9,8,9],[7,10,8,10],[7,11,8,11],[7,12,8,12],[7,13,8,13],[7,15,8,15],[7,16,8,16],[7,17,8,17],[7,18,8,18],[7,35,7,40],[7,41,7,43],[7,44,7,45],[7,20,8,20],[7,21,8,21],[7,22,8,22],[7,23,7,28],[7,29,7,31],[7,32,7,34]]}
[]
[null,null,"Superior Tribunal de Justiça"]
[null,null,"Secretaria de Processamento de Feitos"]
[null,null,"Coordenadoria de Processamento de Feitos em Execução Judicial"]
[null,null,{"$f":"\"Relação das Requisições de Pequeno Valor - RPV pagas pelo STJ em \"&IF(F11=\"\",\"\",UPPER((TEXT(F11,\"mmmm/aaaa\"))))","v":"Relação das Requisições de Pequeno Valor - RPV pagas pelo STJ em "}]
[]
[null,null,"RPV",null,null,null,"P R O C E S S O     D E     O R I G E M",null,null,null,"E N T I D A D E S",null,"R E Q U E R E N T E","A D V O G A D O","Natureza do crédito","I N D I C A D O R E S",null,null,null,null,null,null,null,"VALORES REQUISITADOS",null,null,null,null,null,null,null,null,null,null,null,"VALORES ATUALIZADOS PARA PAGAMENTO"]
[null,null,"Nº","Registro","Autuada em","data do pgto","Ação","Autuada em","Tipo de causa","Trânsito","Entidade devedora","Órgão de origem","Origem do crédito","Origem do crédito",null,"Tributário","EC 94 2016","Lei 13.463 2017","PRC/RPV de origem","Nº DA GRU","DOENÇA GRAVE","Deficiência física","Isento de IR","Beneficiários",null,null,null,null,null,"PSSS",null,null,"R R A",null,null,"Beneficiários",null,null,null,null,null,"P S S S",null,null,"R R A"]
[null,null,null,null,null,null,null,null,null,null,null,null,null,null,null,null,null,null,null,null,null,null,null,"Total","Adv I","Adv II","Adv III","Adv IV","Requerente","Base","Desc","Patronal","NMA","Exercícios anteriores","Desconto","Total","Adv I","Adv II","Adv III","Adv IV","Reqte","BASE desc","Desc","Patronal","Exercícios anteriores","Dedução"]
[]
[null,{"$f":"IF(C11=\"\",\"\",1)","v":""}]
[null,{"$f":"IF(C12=\"\",\"\",B11+1)","v":""}]
[null,{"$f":"IF(C13=\"\",\"\",B12+1)","v":""}]
[null,""]
[null,""]
[null,""]
[null,""]
[null,""]
[null,""]
[null,""]
[null,""]
[null,""]
[null,""]
[null,""]
[null,""]
[null,""]
[null,""]
[null,""]
[null,""]
[null,""]
[null,""]
[null,""]
[null,""]
[null,""]
[null,""]
[null,""]
[null,""]
[null,""]
[null,""]
[null,""]
[null,""]
[null,""]
[null,""]
[null,""]
[null,""]
[null,""]
[null,""]
[null,""]
[null,""]
[null,""]
[null,""]
[null,""]
[null,""]
[null,""]
[null,""]
[null,""]
[null,""]
[null,""]
[null,""]
[null,""]
[null,""]
[null,""]
[null,""]
[null,""]
[null,""]
[null,""]
[null,""]
[null,""]
[null,""]
[null,""]
[null,""]
[null,""]
[null,""]
[null,""]
[null,""]
[null,""]
[null,{"$f":"IF(C77=\"\",\"\",B76+1)","v":""}]
[null,""]
[null,""]
[null,""]
[null,""]
[null,""]
[null,""]
[null,""]
[null,""]
[null,""]
[null,""]
[null,""]
[null,""]
[null,""]
[null,""]
[null,""]
[null,""]
[null,""]
[null,""]
[null,""]
[null,""]
[null,""]
[null,""]
[null,""]
[null,""]
[null,""]
[null,""]
[null,""]
[null,""]
[null,""]
[null,""]
[null,""]
[null,""]
[null,""]
[null,""]
[null,""]
[null,""]
[null,""]
[null,""]
[null,""]
[null,""]
[null,""]
[null,""]
[null,""]
[null,""]
[null,""]
[null,""]
[null,""]
[null,""]
[null,""]
[null,""]
[null,""]
[null,""]
[null,""]
[null,""]
[null,""]
[null,""]
[null,""]
[null,""]
[null,""]
[null,""]
[null,""]
[null,""]
[null,""]
[null,{"$f":"IF(C141=\"\",\"\",B140+1)","v":""}]
[null,""]
[null,""]
[null,""]
[null,""]
[null,""]
[null,""]
[null,""]
[null,""]
[null,""]
[null,""]
[null,""]
[null,""]
[null,""]
[null,""]
[null,""]
[null,""]
[null,""]
[null,""]
[null,""]
[null,""]
[null,""]
[null,""]
[null,""]
[null,""]
[null,""]
[null,""]
[null,""]
[null,""]
[null,""]
[null,""]
[null,""]
[null,""]
[null,""]
[null,""]
[null,""]
[null,""]
[null,""]
[null,""]
[null,""]
[null,""]
[null,""]
[null,""]
[null,""]
[null,""]
[null,""]
[null,""]
[null,""]
[null,""]
[null,""]
[null,""]
[null,""]
[null,""]
[null,""]
[null,""]
[null,""]
[null,""]
[null,""]
[null,""]
[null,""]
[null,""]
[null,""]
[null,""]
[null,""]
[null,{"$f":"IF(C205=\"\",\"\",B204+1)","v":""}]
[null,""]
[null,""]
[null,""]
[null,""]
[null,""]
[null,""]
[null,""]
[null,""]
[null,""]
[null,""]
[null,""]
[null,""]
[null,""]
[null,""]
[null,""]
[null,""]
[null,""]
[null,""]
[null,""]
[null,""]
[null,""]
[null,""]
[null,""]
[null,""]
[null,""]
[null,""]
[null,""]
[null,""]
[null,""]
[null,""]
[null,""]
[null,""]
[null,""]
[null,""]
[null,""]
[null,""]
[null,""]
[null,""]
[null,""]
[null,""]
[null,""]
[null,""]
[null,""]
[null,""]
[null,""]
[null,""]
[null,""]
[null,""]
[null,""]
[null,""]
[null,""]
[null,""]
[null,""]
[null,""]
[null,""]
[null,""]
[null,""]
[null,""]
[null,""]
[null,""]
[null,""]
[null,""]
[null,""]
[null,{"$f":"IF(C269=\"\",\"\",B268+1)","v":""}]
[null,""]
[null,""]
[null,""]
[null,""]
[null,""]
[null,""]
[null,""]
[null,""]
[null,""]
[null,""]
[null,""]
[null,""]
[null,""]
[null,""]
[null,""]
[null,""]
[null,""]
[null,""]
[null,""]
[null,""]
[null,""]
[null,""]
[null,""]
[null,""]
[null,""]
[null,""]
[null,""]
[null,""]
[null,""]
[null,""]
[null,""]
[null,""]
[null,""]
[null,""]
[null,""]
[null,""]
[null,""]
[null,""]
[null,""]
[null,""]
[null,""]
[null,""]
[null,""]
[null,""]
[null,""]
[null,""]
[null,""]
[null,""]
[null,""]
[null,""]
[null,""]
[null,""]
[null,""]
[null,""]
[null,""]
[null,""]
[null,""]
[null,""]
[null,""]
[null,""]
[null,""]
[null,""]
[null,""]
[null,{"$f":"IF(C333=\"\",\"\",B332+1)","v":""}]
[null,""]
[null,""]
[null,""]
[null,""]
[null,""]
[null,""]
[null,""]
[null,""]
[null,""]
[null,""]
[null,""]
[null,""]
[null,""]
[null,""]
[null,""]
[null,""]
[null,""]
[null,""]
[null,""]
[null,""]
[null,""]
[null,""]
[null,""]
[null,""]
[null,""]
[null,""]
[null,""]
[null,""]
[null,""]
[null,""]
[null,""]
[null,""]
[null,""]
[null,""]
[null,""]
[null,""]
[null,""]
[null,""]
[null,""]
[null,""]
[null,""]
[null,""]
[null,""]
[null,""]
[null,""]
[null,""]
[null,""]
[null,""]
[null,""]
[null,""]
[null,""]
[null,""]
[null,""]
[null,""]
[null,""]
[null,""]
[null,""]
[null,""]
[null,""]
[null,""]
[null,""]
[null,""]
[null,""]
[null,{"$f":"IF(C397=\"\",\"\",B396+1)","v":""}]
[null,""]
[null,""]
[null,""]
[null,""]
[null,""]
[null,""]
[null,""]
[null,""]
[null,""]
[null,""]
[null,""]
[null,""]
[null,""]
[null,""]
[null,""]
[null,""]
[null,""]
[null,""]
[null,""]
[null,""]
[null,""]
[null,""]
[null,""]
[null,""]
[null,""]
[null,""]
[null,""]
[null,""]
[null,""]
[null,""]
[null,""]
[null,""]
[null,""]
[null,""]
[null,""]
[null,""]
[null,""]
[null,""]
[null,""]
[null,""]
[null,""]
[null,""]
[null,""]
[null,""]
[null,""]
[null,""]
[null,""]
[null,""]
[null,""]
[null,""]
[null,""]
[null,""]
[null,""]
[null,""]
[null,""]
[null,""]
[null,""]
[null,""]
[null,""]
[null,""]
[null,""]
[null,""]
[null,""]
[null,{"$f":"IF(C461=\"\",\"\",B460+1)","v":""}]
[null,""]
[null,""]
[null,""]
[null,""]
[null,""]
[null,""]
[null,""]
[null,""]
[null,""]
[null,""]
[null,""]
[null,""]
[null,""]
[null,""]
[null,""]
[null,""]
[null,""]
[null,""]
[null,""]
[null,""]
[null,""]
[null,""]
[null,""]
[null,""]
[null,""]
[null,""]
[null,""]
[null,""]
[null,""]
[null,""]
[null,""]
[null,""]
[null,""]
[null,""]
[null,""]
[null,""]
[null,""]
[null,""]
[null,""]
[null,""]
[null,""]
[null,""]
[null,""]
[null,""]
[null,""]
[null,""]
[null,""]
[null,""]
[null,""]
[]
[null,null,null,null,null,null,null,null,null,null,null,null,null,null,null,null,null,null,null,null,null,null,null,null,null,null,null,null,null,null,null,null,null,null,"Totais pagas",{"$f":"SUM(AJ11:AJ510)","v":0},{"$f":"SUM(AK11:AK510)","v":0},0,0,0,{"$f":"SUM(AO11:AO510)","v":0}]

{"sheet":"Guia 3","index":2,"n_rows":512,"n_cols":46,"rows_kept":512,"cut":false,"hidden":true,"merged":[[4,2,4,8],[5,4,5,7],[6,2,6,5],[6,6,6,9],[6,10,6,11],[7,19,8,19],[6,15,6,22],[6,23,6,34],[6,35,6,45],[7,2,8,2],[7,3,8,3],[7,4,8,4],[7,5,8,5],[7,6,8,6],[7,7,8,7],[7,8,8,8],[6,14,8,14],[7,9,8,9],[7,10,8,10],[7,11,8,11],[7,12,8,12],[7,13,8,13],[7,15,8,15],[7,16,8,16],[7,17,8,17],[7,18,8,18],[7,35,7,40],[7,41,7,43],[7,44,7,45],[7,20,8,20],[7,21,8,21],[7,22,8,22],[7,23,7,28],[7,29,7,31],[7,32,7,34]]}
[]
[null,null,"Superior Tribunal de Justiça"]
[null,null,"Secretaria de Processamento de Feitos"]
[null,null,"Coordenadoria de Processamento de Feitos em Execução Judicial"]
[null,null,{"$f":"\"Relação das Requisições de Pequeno Valor - RPV pagas pelo STJ em \"&IF(F11=\"\",\"\",UPPER((TEXT(F11,\"mmmm/aaaa\"))))","v":"Relação das Requisições de Pequeno Valor - RPV pagas pelo STJ em "}]
[]
[null,null,"RPV",null,null,null,"P R O C E S S O     D E     O R I G E M",null,null,null,"E N T I D A D E S",null,"R E Q U E R E N T E","A D V O G A D O","Natureza do crédito","I N D I C A D O R E S",null,null,null,null,null,null,null,"VALORES REQUISITADOS",null,null,null,null,null,null,null,null,null,null,null,"VALORES ATUALIZADOS PARA PAGAMENTO"]
[null,null,"Nº","Registro","Autuada em","data do pgto","Ação","Autuada em","Tipo de causa","Trânsito","Entidade devedora","Órgão de origem","Origem do crédito","Origem do crédito",null,"Tributário","EC 94 2016","Lei 13.463 2017","PRC/RPV de origem","Nº DA GRU","DOENÇA GRAVE","Deficiência física","Isento de IR","Beneficiários",null,null,null,null,null,"PSSS",null,null,"R R A",null,null,"Beneficiários",null,null,null,null,null,"P S S S",null,null,"R R A"]
[null,null,null,null,null,null,null,null,null,null,null,null,null,null,null,null,null,null,null,null,null,null,null,"Total","Adv I","Adv II","Adv III","Adv IV","Requerente","Base","Desc","Patronal","NMA","Exercícios anteriores","Desconto","Total","Adv I","Adv II","Adv III","Adv IV","Reqte","BASE desc","Desc","Patronal","Exercícios anteriores","Dedução"]
[]
[null,{"$f":"IF(C11=\"\",\"\",1)","v":""}]
[null,{"$f":"IF(C12=\"\",\"\",B11+1)","v":""}]
[null,{"$f":"IF(C13=\"\",\"\",B12+1)","v":""}]
[null,""]
[null,""]
[null,""]
[null,""]
[null,""]
[null,""]
[null,""]
[null,""]
[null,""]
[null,""]
[null,""]
[null,""]
[null,""]
[null,""]
[null,""]
[null,""]
[null,""]
[null,""]
[null,""]
[null,""]
[null,""]
[null,""]
[null,""]
[null,""]
[null,""]
[null,""]
[null,""]
[null,""]
[null,""]
[null,""]
[null,""]
[null,""]
[null,""]
[null,""]
[null,""]
[null,""]
[null,""]
[null,""]
[null,""]
[null,""]
[null,""]
[null,""]
[null,""]
[null,""]
[null,""]
[null,""]
[null,""]
[null,""]
[null,""]
[null,""]
[null,""]
[null,""]
[null,""]
[null,""]
[null,""]
[null,""]
[null,""]
[null,""]
[null,""]
[null,""]
[null,""]
[null,""]
[null,""]
[null,{"$f":"IF(C77=\"\",\"\",B76+1)","v":""}]
[null,""]
[null,""]
[null,""]
[null,""]
[null,""]
[null,""]
[null,""]
[null,""]
[null,""]
[null,""]
[null,""]
[null,""]
[null,""]
[null,""]
[null,""]
[null,""]
[null,""]
[null,""]
[null,""]
[null,""]
[null,""]
[null,""]
[null,""]
[null,""]
[null,""]
[null,""]
[null,""]
[null,""]
[null,""]
[null,""]
[null,""]
[null,""]
[null,""]
[null,""]
[null,""]
[null,""]
[null,""]
[null,""]
[null,""]
[null,""]
[null,""]
[null,""]
[null,""]
[null,""]
[null,""]
[null,""]
[null,""]
[null,""]
[null,""]
[null,""]
[null,""]
[null,""]
[null,""]
[null,""]
[null,""]
[null,""]
[null,""]
[null,""]
[null,""]
[null,""]
[null,""]
[null,""]
[null,""]
[null,{"$f":"IF(C141=\"\",\"\",B140+1)","v":""}]
[null,""]
[null,""]
[null,""]
[null,""]
[null,""]
[null,""]
[null,""]
[null,""]
[null,""]
[null,""]
[null,""]
[null,""]
[null,""]
[null,""]
[null,""]
[null,""]
[null,""]
[null,""]
[null,""]
[null,""]
[null,""]
[null,""]
[null,""]
[null,""]
[null,""]
[null,""]
[null,""]
[null,""]
[null,""]
[null,""]
[null,""]
[null,""]
[null,""]
[null,""]
[null,""]
[null,""]
[null,""]
[null,""]
[null,""]
[null,""]
[null,""]
[null,""]
[null,""]
[null,""]
[null,""]
[null,""]
[null,""]
[null,""]
[null,""]
[null,""]
[null,""]
[null,""]
[null,""]
[null,""]
[null,""]
[null,""]
[null,""]
[null,""]
[null,""]
[null,""]
[null,""]
[null,""]
[null,""]
[null,{"$f":"IF(C205=\"\",\"\",B204+1)","v":""}]
[null,""]
[null,""]
[null,""]
[null,""]
[null,""]
[null,""]
[null,""]
[null,""]
[null,""]
[null,""]
[null,""]
[null,""]
[null,""]
[null,""]
[null,""]
[null,""]
[null,""]
[null,""]
[null,""]
[null,""]
[null,""]
[null,""]
[null,""]
[null,""]
[null,""]
[null,""]
[null,""]
[null,""]
[null,""]
[null,""]
[null,""]
[null,""]
[null,""]
[null,""]
[null,""]
[null,""]
[null,""]
[null,""]
[null,""]
[null,""]
[null,""]
[null,""]
[null,""]
[null,""]
[null,""]
[null,""]
[null,""]
[null,""]
[null,""]
[null,""]
[null,""]
[null,""]
[null,""]
[null,""]
[null,""]
[null,""]
[null,""]
[null,""]
[null,""]
[null,""]
[null,""]
[null,""]
[null,""]
[null,{"$f":"IF(C269=\"\",\"\",B268+1)","v":""}]
[null,""]
[null,""]
[null,""]
[null,""]
[null,""]
[null,""]
[null,""]
[null,""]
[null,""]
[null,""]
[null,""]
[null,""]
[null,""]
[null,""]
[null,""]
[null,""]
[null,""]
[null,""]
[null,""]
[null,""]
[null,""]
[null,""]
[null,""]
[null,""]
[null,""]
[null,""]
[null,""]
[null,""]
[null,""]
[null,""]
[null,""]
[null,""]
[null,""]
[null,""]
[null,""]
[null,""]
[null,""]
[null,""]
[null,""]
[null,""]
[null,""]
[null,""]
[null,""]
[null,""]
[null,""]
[null,""]
[null,""]
[null,""]
[null,""]
[null,""]
[null,""]
[null,""]
[null,""]
[null,""]
[null,""]
[null,""]
[null,""]
[null,""]
[null,""]
[null,""]
[null,""]
[null,""]
[null,""]
[null,{"$f":"IF(C333=\"\",\"\",B332+1)","v":""}]
[null,""]
[null,""]
[null,""]
[null,""]
[null,""]
[null,""]
[null,""]
[null,""]
[null,""]
[null,""]
[null,""]
[null,""]
[null,""]
[null,""]
[null,""]
[null,""]
[null,""]
[null,""]
[null,""]
[null,""]
[null,""]
[null,""]
[null,""]
[null,""]
[null,""]
[null,""]
[null,""]
[null,""]
[null,""]
[null,""]
[null,""]
[null,""]
[null,""]
[null,""]
[null,""]
[null,""]
[null,""]
[null,""]
[null,""]
[null,""]
[null,""]
[null,""]
[null,""]
[null,""]
[null,""]
[null,""]
[null,""]
[null,""]
[null,""]
[null,""]
[null,""]
[null,""]
[null,""]
[null,""]
[null,""]
[null,""]
[null,""]
[null,""]
[null,""]
[null,""]
[null,""]
[null,""]
[null,""]
[null,{"$f":"IF(C397=\"\",\"\",B396+1)","v":""}]
[null,""]
[null,""]
[null,""]
[null,""]
[null,""]
[null,""]
[null,""]
[null,""]
[null,""]
[null,""]
[null,""]
[null,""]
[null,""]
[null,""]
[null,""]
[null,""]
[null,""]
[null,""]
[null,""]
[null,""]
[null,""]
[null,""]
[null,""]
[null,""]
[null,""]
[null,""]
[null,""]
[null,""]
[null,""]
[null,""]
[null,""]
[null,""]
[null,""]
[null,""]
[null,""]
[null,""]
[null,""]
[null,""]
[null,""]
[null,""]
[null,""]
[null,""]
[null,""]
[null,""]
[null,""]
[null,""]
[null,""]
[null,""]
[null,""]
[null,""]
[null,""]
[null,""]
[null,""]
[null,""]
[null,""]
[null,""]
[null,""]
[null,""]
[null,""]
[null,""]
[null,""]
[null,""]
[null,""]
[null,{"$f":"IF(C461=\"\",\"\",B460+1)","v":""}]
[null,""]
[null,""]
[null,""]
[null,""]
[null,""]
[null,""]
[null,""]
[null,""]
[null,""]
[null,""]
[null,""]
[null,""]
[null,""]
[null,""]
[null,""]
[null,""]
[null,""]
[null,""]
[null,""]
[null,""]
[null,""]
[null,""]
[null,""]
[null,""]
[null,""]
[null,""]
[null,""]
[null,""]
[null,""]
[null,""]
[null,""]
[null,""]
[null,""]
[null,""]
[null,""]
[null,""]
[null,""]
[null,""]
[null,""]
[null,""]
[null,""]
[null,""]
[null,""]
[null,""]
[null,""]
[null,""]
[null,""]
[null,""]
[null,""]
[]
[null,null,null,null,null,null,null,null,null,null,null,null,null,null,null,null,null,null,null,null,null,null,null,null,null,null,null,null,null,null,null,null,null,null,"Totais pagas",{"$f":"SUM(AJ11:AJ510)","v":0},{"$f":"SUM(AK11:AK510)","v":0},0,0,0,{"$f":"SUM(AO11:AO510)","v":0}]

{"sheet":"Guia 4","index":3,"n_rows":512,"n_cols":46,"rows_kept":512,"cut":false,"hidden":true,"merged":[[4,2,4,8],[5,4,5,7],[6,2,6,5],[6,6,6,9],[6,10,6,11],[7,19,8,19],[6,15,6,22],[6,23,6,34],[6,35,6,45],[7,2,8,2],[7,3,8,3],[7,4,8,4],[7,5,8,5],[7,6,8,6],[7,7,8,7],[7,8,8,8],[6,14,8,14],[7,9,8,9],[7,10,8,10],[7,11,8,11],[7,12,8,12],[7,13,8,13],[7,15,8,15],[7,16,8,16],[7,17,8,17],[7,18,8,18],[7,35,7,40],[7,41,7,43],[7,44,7,45],[7,20,8,20],[7,21,8,21],[7,22,8,22],[7,23,7,28],[7,29,7,31],[7,32,7,34]]}
[]
[null,null,"Superior Tribunal de Justiça"]
[null,null,"Secretaria de Processamento de Feitos"]
[null,null,"Coordenadoria de Processamento de Feitos em Execução Judicial"]
[null,null,{"$f":"\"Relação das Requisições de Pequeno Valor - RPV pagas pelo STJ em \"&IF(F11=\"\",\"\",UPPER((TEXT(F11,\"mmmm/aaaa\"))))","v":"Relação das Requisições de Pequeno Valor - RPV pagas pelo STJ em "}]
[]
[null,null,"RPV",null,null,null,"P R O C E S S O     D E     O R I G E M",null,null,null,"E N T I D A D E S",null,"R E Q U E R E N T E","A D V O G A D O","Natureza do crédito","I N D I C A D O R E S",null,null,null,null,null,null,null,"VALORES REQUISITADOS",null,null,null,null,null,null,null,null,null,null,null,"VALORES ATUALIZADOS PARA PAGAMENTO"]
[null,null,"Nº","Registro","Autuada em","data do pgto","Ação","Autuada em","Tipo de causa","Trânsito","Entidade devedora","Órgão de origem","Origem do crédito","Origem do crédito",null,"Tributário","EC 94 2016","Lei 13.463 2017","PRC/RPV de origem","Nº DA GRU","DOENÇA GRAVE","Deficiência física","Isento de IR","Beneficiários",null,null,null,null,null,"PSSS",null,null,"R R A",null,null,"Beneficiários",null,null,null,null,null,"P S S S",null,null,"R R A"]
[null,null,null,null,null,null,null,null,null,null,null,null,null,null,null,null,null,null,null,null,null,null,null,"Total","Adv I","Adv II","Adv III","Adv IV","Requerente","Base","Desc","Patronal","NMA","Exercícios anteriores","Desconto","Total","Adv I","Adv II","Adv III","Adv IV","Reqte","BASE desc","Desc","Patronal","Exercícios anteriores","Dedução"]
[]
[null,{"$f":"IF(C11=\"\",\"\",1)","v":""}]
[null,{"$f":"IF(C12=\"\",\"\",B11+1)","v":""}]
[null,{"$f":"IF(C13=\"\",\"\",B12+1)","v":""}]
[null,""]
[null,""]
[null,""]
[null,""]
[null,""]
[null,""]
[null,""]
[null,""]
[null,""]
[null,""]
[null,""]
[null,""]
[null,""]
[null,""]
[null,""]
[null,""]
[null,""]
[null,""]
[null,""]
[null,""]
[null,""]
[null,""]
[null,""]
[null,""]
[null,""]
[null,""]
[null,""]
[null,""]
[null,""]
[null,""]
[null,""]
[null,""]
[null,""]
[null,""]
[null,""]
[null,""]
[null,""]
[null,""]
[null,""]
[null,""]
[null,""]
[null,""]
[null,""]
[null,""]
[null,""]
[null,""]
[null,""]
[null,""]
[null,""]
[null,""]
[null,""]
[null,""]
[null,""]
[null,""]
[null,""]
[null,""]
[null,""]
[null,""]
[null,""]
[null,""]
[null,""]
[null,""]
[null,""]
[null,{"$f":"IF(C77=\"\",\"\",B76+1)","v":""}]
[null,""]
[null,""]
[null,""]
[null,""]
[null,""]
[null,""]
[null,""]
[null,""]
[null,""]
[null,""]
[null,""]
[null,""]
[null,""]
[null,""]
[null,""]
[null,""]
[null,""]
[null,""]
[null,""]
[null,""]
[null,""]
[null,""]
[null,""]
[null,""]
[null,""]
[null,""]
[null,""]
[null,""]
[null,""]
[null,""]
[null,""]
[null,""]
[null,""]
[null,""]
[null,""]
[null,""]
[null,""]
[null,""]
[null,""]
[null,""]
[null,""]
[null,""]
[null,""]
[null,""]
[null,""]
[null,""]
[null,""]
[null,""]
[null,""]
[null,""]
[null,""]
[null,""]
[null,""]
[null,""]
[null,""]
[null,""]
[null,""]
[null,""]
[null,""]
[null,""]
[null,""]
[null,""]
[null,""]
[null,{"$f":"IF(C141=\"\",\"\",B140+1)","v":""}]
[null,""]
[null,""]
[null,""]
[null,""]
[null,""]
[null,""]
[null,""]
[null,""]
[null,""]
[null,""]
[null,""]
[null,""]
[null,""]
[null,""]
[null,""]
[null,""]
[null,""]
[null,""]
[null,""]
[null,""]
[null,""]
[null,""]
[null,""]
[null,""]
[null,""]
[null,""]
[null,""]
[null,""]
[null,""]
[null,""]
[null,""]
[null,""]
[null,""]
[null,""]
[null,""]
[null,""]
[null,""]
[null,""]
[null,""]
[null,""]
[null,""]
[null,""]
[null,""]
[null,""]
[null,""]
[null,""]
[null,""]
[null,""]
[null,""]
[null,""]
[null,""]
[null,""]
[null,""]
[null,""]
[null,""]
[null,""]
[null,""]
[null,""]
[null,""]
[null,""]
[null,""]
[null,""]
[null,""]
[null,{"$f":"IF(C205=\"\",\"\",B204+1)","v":""}]
[null,""]
[null,""]
[null,""]
[null,""]
[null,""]
[null,""]
[null,""]
[null,""]
[null,""]
[null,""]
[null,""]
[null,""]
[null,""]
[null,""]
[null,""]
[null,""]
[null,""]
[null,""]
[null,""]
[null,""]
[null,""]
[null,""]
[null,""]
[null,""]
[null,""]
[null,""]
[null,""]
[null,""]
[null,""]
[null,""]
[null,""]
[null,""]
[null,""]
[null,""]
[null,""]
[null,""]
[null,""]
[null,""]
[null,""]
[null,""]
[null,""]
[null,""]
[null,""]
[null,""]
[null,""]
[null,""]
[null,""]
[null,""]
[null,""]
[null,""]
[null,""]
[null,""]
[null,""]
[null,""]
[null,""]
[null,""]
[null,""]
[null,""]
[null,""]
[null,""]
[null,""]
[null,""]
[null,""]
[null,{"$f":"IF(C269=\"\",\"\",B268+1)","v":""}]
[null,""]
[null,""]
[null,""]
[null,""]
[null,""]
[null,""]
[null,""]
[null,""]
[null,""]
[null,""]
[null,""]
[null,""]
[null,""]
[null,""]
[null,""]
[null,""]
[null,""]
[null,""]
[null,""]
[null,""]
[null,""]
[null,""]
[null,""]
[null,""]
[null,""]
[null,""]
[null,""]
[null,""]
[null,""]
[null,""]
[null,""]
[null,""]
[null,""]
[null,""]
[null,""]
[null,""]
[null,""]
[null,""]
[null,""]
[null,""]
[null,""]
[null,""]
[null,""]
[null,""]
[null,""]
[null,""]
[null,""]
[null,""]
[null,""]
[null,""]
[null,""]
[null,""]
[null,""]
[null,""]
[null,""]
[null,""]
[null,""]
[null,""]
[null,""]
[null,""]
[null,""]
[null,""]
[null,""]
[null,{"$f":"IF(C333=\"\",\"\",B332+1)","v":""}]
[null,""]
[null,""]
[null,""]
[null,""]
[null,""]
[null,""]
[null,""]
[null,""]
[null,""]
[null,""]
[null,""]
[null,""]
[null,""]
[null,""]
[null,""]
[null,""]
[null,""]
[null,""]
[null,""]
[null,""]
[null,""]
[null,""]
[null,""]
[null,""]
[null,""]
[null,""]
[null,""]
[null,""]
[null,""]
[null,""]
[null,""]
[null,""]
[null,""]
[null,""]
[null,""]
[null,""]
[null,""]
[null,""]
[null,""]
[null,""]
[null,""]
[null,""]
[null,""]
[null,""]
[null,""]
[null,""]
[null,""]
[null,""]
[null,""]
[null,""]
[null,""]
[null,""]
[null,""]
[null,""]
[null,""]
[null,""]
[null,""]
[null,""]
[null,""]
[null,""]
[null,""]
[null,""]
[null,""]
[null,{"$f":"IF(C397=\"\",\"\",B396+1)","v":""}]
[null,""]
[null,""]
[null,""]
[null,""]
[null,""]
[null,""]
[null,""]
[null,""]
[null,""]
[null,""]
[null,""]
[null,""]
[null,""]
[null,""]
[null,""]
[null,""]
[null,""]
[null,""]
[null,""]
[null,""]
[null,""]
[null,""]
[null,""]
[null,""]
[null,""]
[null,""]
[null,""]
[null,""]
[null,""]
[null,""]
[null,""]
[null,""]
[null,""]
[null,""]
[null,""]
[null,""]
[null,""]
[null,""]
[null,""]
[null,""]
[null,""]
[null,""]
[null,""]
[null,""]
[null,""]
[null,""]
[null,""]
[null,""]
[null,""]
[null,""]
[null,""]
[null,""]
[null,""]
[null,""]
[null,""]
[null,""]
[null,""]
[null,""]
[null,""]
[null,""]
[null,""]
[null,""]
[null,""]
[null,{"$f":"IF(C461=\"\",\"\",B460+1)","v":""}]
[null,""]
[null,""]
[null,""]
[null,""]
[null,""]
[null,""]
[null,""]
[null,""]
[null,""]
[null,""]
[null,""]
[null,""]
[null,""]
[null,""]
[null,""]
[null,""]
[null,""]
[null,""]
[null,""]
[null,""]
[null,""]
[null,""]
[null,""]
[null,""]
[null,""]
[null,""]
[null,""]
[null,""]
[null,""]
[null,""]
[null,""]
[null,""]
[null,""]
[null,""]
[null,""]
[null,""]
[null,""]
[null,""]
[null,""]
[null,""]
[null,""]
[null,""]
[null,""]
[null,""]
[null,""]
[null,""]
[null,""]
[null,""]
[null,""]
[]
[null,null,null,null,null,null,null,null,null,null,null,null,null,null,null,null,null,null,null,null,null,null,null,null,null,null,null,null,null,null,null,null,null,null,"Totais pagas",{"$f":"SUM(AJ11:AJ510)","v":0},{"$f":"SUM(AK11:AK510)","v":0},0,0,0,{"$f":"SUM(AO11:AO510)","v":0}]

{"sheet":"Guia 5","index":4,"n_rows":512,"n_cols":46,"rows_kept":512,"cut":false,"hidden":true,"merged":[[4,2,4,8],[5,4,5,7],[6,2,6,5],[6,6,6,9],[6,10,6,11],[7,19,8,19],[6,15,6,22],[6,23,6,34],[6,35,6,45],[7,2,8,2],[7,3,8,3],[7,4,8,4],[7,5,8,5],[7,6,8,6],[7,7,8,7],[7,8,8,8],[6,14,8,14],[7,9,8,9],[7,10,8,10],[7,11,8,11],[7,12,8,12],[7,13,8,13],[7,15,8,15],[7,16,8,16],[7,17,8,17],[7,18,8,18],[7,35,7,40],[7,41,7,43],[7,44,7,45],[7,20,8,20],[7,21,8,21],[7,22,8,22],[7,23,7,28],[7,29,7,31],[7,32,7,34]]}
[]
[null,null,"Superior Tribunal de Justiça"]
[null,null,"Secretaria de Processamento de Feitos"]
[null,null,"Coordenadoria de Processamento de Feitos em Execução Judicial"]
[null,null,{"$f":"\"Relação das Requisições de Pequeno Valor - RPV pagas pelo STJ em \"&IF(F11=\"\",\"\",UPPER((TEXT(F11,\"mmmm/aaaa\"))))","v":"Relação das Requisições de Pequeno Valor - RPV pagas pelo STJ em "}]
[]
[null,null,"RPV",null,null,null,"P R O C E S S O     D E     O R I G E M",null,null,null,"E N T I D A D E S",null,"R E Q U E R E N T E","A D V O G A D O","Natureza do crédito","I N D I C A D O R E S",null,null,null,null,null,null,null,"VALORES REQUISITADOS",null,null,null,null,null,null,null,null,null,null,null,"VALORES ATUALIZADOS PARA PAGAMENTO"]
[null,null,"Nº","Registro","Autuada em","data do pgto","Ação","Autuada em","Tipo de causa","Trânsito","Entidade devedora","Órgão de origem","Origem do crédito","Origem do crédito",null,"Tributário","EC 94 2016","Lei 13.463 2017","PRC/RPV de origem","Nº DA GRU","DOENÇA GRAVE","Deficiência física","Isento de IR","Beneficiários",null,null,null,null,null,"PSSS",null,null,"R R A",null,null,"Beneficiários",null,null,null,null,null,"P S S S",null,null,"R R A"]
[null,null,null,null,null,null,null,null,null,null,null,null,null,null,null,null,null,null,null,null,null,null,null,"Total","Adv I","Adv II","Adv III","Adv IV","Requerente","Base","Desc","Patronal","NMA","Exercícios anteriores","Desconto","Total","Adv I","Adv II","Adv III","Adv IV","Reqte","BASE desc","Desc","Patronal","Exercícios anteriores","Dedução"]
[]
[null,{"$f":"IF(C11=\"\",\"\",1)","v":""}]
[null,{"$f":"IF(C12=\"\",\"\",B11+1)","v":""}]
[null,{"$f":"IF(C13=\"\",\"\",B12+1)","v":""}]
[null,""]
[null,""]
[null,""]
[null,""]
[null,""]
[null,""]
[null,""]
[null,""]
[null,""]
[null,""]
[null,""]
[null,""]
[null,""]
[null,""]
[null,""]
[null,""]
[null,""]
[null,""]
[null,""]
[null,""]
[null,""]
[null,""]
[null,""]
[null,""]
[null,""]
[null,""]
[null,""]
[null,""]
[null,""]
[null,""]
[null,""]
[null,""]
[null,""]
[null,""]
[null,""]
[null,""]
[null,""]
[null,""]
[null,""]
[null,""]
[null,""]
[null,""]
[null,""]
[null,""]
[null,""]
[null,""]
[null,""]
[null,""]
[null,""]
[null,""]
[null,""]
[null,""]
[null,""]
[null,""]
[null,""]
[null,""]
[null,""]
[null,""]
[null,""]
[null,""]
[null,""]
[null,""]
[null,""]
[null,{"$f":"IF(C77=\"\",\"\",B76+1)","v":""}]
[null,""]
[null,""]
[null,""]
[null,""]
[null,""]
[null,""]
[null,""]
[null,""]
[null,""]
[null,""]
[null,""]
[null,""]
[null,""]
[null,""]
[null,""]
[null,""]
[null,""]
[null,""]
[null,""]
[null,""]
[null,""]
[null,""]
[null,""]
[null,""]
[null,""]
[null,""]
[null,""]
[null,""]
[null,""]
[null,""]
[null,""]
[null,""]
[null,""]
[null,""]
[null,""]
[null,""]
[null,""]
[null,""]
[null,""]
[null,""]
[null,""]
[null,""]
[null,""]
[null,""]
[null,""]
[null,""]
[null,""]
[null,""]
[null,""]
[null,""]
[null,""]
[null,""]
[null,""]
[null,""]
[null,""]
[null,""]
[null,""]
[null,""]
[null,""]
[null,""]
[null,""]
[null,""]
[null,""]
[null,{"$f":"IF(C141=\"\",\"\",B140+1)","v":""}]
[null,""]
[null,""]
[null,""]
[null,""]
[null,""]
[null,""]
[null,""]
[null,""]
[null,""]
[null,""]
[null,""]
[null,""]
[null,""]
[null,""]
[null,""]
[null,""]
[null,""]
[null,""]
[null,""]
[null,""]
[null,""]
[null,""]
[null,""]
[null,""]
[null,""]
[null,""]
[null,""]
[null,""]
[null,""]
[null,""]
[null,""]
[null,""]
[null,""]
[null,""]
[null,""]
[null,""]
[null,""]
[null,""]
[null,""]
[null,""]
[null,""]
[null,""]
[null,""]
[null,""]
[null,""]
[null,""]
[null,""]
[null,""]
[null,""]
[null,""]
[null,""]
[null,""]
[null,""]
[null,""]
[null,""]
[null,""]
[null,""]
[null,""]
[null,""]
[null,""]
[null,""]
[null,""]
[null,""]
[null,{"$f":"IF(C205=\"\",\"\",B204+1)","v":""}]
[null,""]
[null,""]
[null,""]
[null,""]
[null,""]
[null,""]
[null,""]
[null,""]
[null,""]
[null,""]
[null,""]
[null,""]
[null,""]
[null,""]
[null,""]
[null,""]
[null,""]
[null,""]
[null,""]
[null,""]
[null,""]
[null,""]
[null,""]
[null,""]
[null,""]
[null,""]
[null,""]
[null,""]
[null,""]
[null,""]
[null,""]
[null,""]
[null,""]
[null,""]
[null,""]
[null,""]
[null,""]
[null,""]
[null,""]
[null,""]
[null,""]
[null,""]
[null,""]
[null,""]
[null,""]
[null,""]
[null,""]
[null,""]
[null,""]
[null,""]
[null,""]
[null,""]
[null,""]
[null,""]
[null,""]
[null,""]
[null,""]
[null,""]
[null,""]
[null,""]
[null,""]
[null,""]
[null,""]
[null,{"$f":"IF(C269=\"\",\"\",B268+1)","v":""}]
[null,""]
[null,""]
[null,""]
[null,""]
[null,""]
[null,""]
[null,""]
[null,""]
[null,""]
[null,""]
[null,""]
[null,""]
[null,""]
[null,""]
[null,""]
[null,""]
[null,""]
[null,""]
[null,""]
[null,""]
[null,""]
[null,""]
[null,""]
[null,""]
[null,""]
[null,""]
[null,""]
[null,""]
[null,""]
[null,""]
[null,""]
[null,""]
[null,""]
[null,""]
[null,""]
[null,""]
[null,""]
[null,""]
[null,""]
[null,""]
[null,""]
[null,""]
[null,""]
[null,""]
[null,""]
[null,""]
[null,""]
[null,""]
[null,""]
[null,""]
[null,""]
[null,""]
[null,""]
[null,""]
[null,""]
[null,""]
[null,""]
[null,""]
[null,""]
[null,""]
[null,""]
[null,""]
[null,""]
[null,{"$f":"IF(C333=\"\",\"\",B332+1)","v":""}]
[null,""]
[null,""]
[null,""]
[null,""]
[null,""]
[null,""]
[null,""]
[null,""]
[null,""]
[null,""]
[null,""]
[null,""]
[null,""]
[null,""]
[null,""]
[null,""]
[null,""]
[null,""]
[null,""]
[null,""]
[null,""]
[null,""]
[null,""]
[null,""]
[null,""]
[null,""]
[null,""]
[null,""]
[null,""]
[null,""]
[null,""]
[null,""]
[null,""]
[null,""]
[null,""]
[null,""]
[null,""]
[null,""]
[null,""]
[null,""]
[null,""]
[null,""]
[null,""]
[null,""]
[null,""]
[null,""]
[null,""]
[null,""]
[null,""]
[null,""]
[null,""]
[null,""]
[null,""]
[null,""]
[null,""]
[null,""]
[null,""]
[null,""]
[null,""]
[null,""]
[null,""]
[null,""]
[null,""]
[null,{"$f":"IF(C397=\"\",\"\",B396+1)","v":""}]
[null,""]
[null,""]
[null,""]
[null,""]
[null,""]
[null,""]
[null,""]
[null,""]
[null,""]
[null,""]
[null,""]
[null,""]
[null,""]
[null,""]
[null,""]
[null,""]
[null,""]
[null,""]
[null,""]
[null,""]
[null,""]
[null,""]
[null,""]
[null,""]
[null,""]
[null,""]
[null,""]
[null,""]
[null,""]
[null,""]
[null,""]
[null,""]
[null,""]
[null,""]
[null,""]
[null,""]
[null,""]
[null,""]
[null,""]
[null,""]
[null,""]
[null,""]
[null,""]
[null,""]
[null,""]
[null,""]
[null,""]
[null,""]
[null,""]
[null,""]
[null,""]
[null,""]
[null,""]
[null,""]
[null,""]
[null,""]
[null,""]
[null,""]
[null,""]
[null,""]
[null,""]
[null,""]
[null,""]
[null,{"$f":"IF(C461=\"\",\"\",B460+1)","v":""}]
[null,""]
[null,""]
[null,""]
[null,""]
[null,""]
[null,""]
[null,""]
[null,""]
[null,""]
[null,""]
[null,""]
[null,""]
[null,""]
[null,""]
[null,""]
[null,""]
[null,""]
[null,""]
[null,""]
[null,""]
[null,""]
[null,""]
[null,""]
[null,""]
[null,""]
[null,""]
[null,""]
[null,""]
[null,""]
[null,""]
[null,""]
[null,""]
[null,""]
[null,""]
[null,""]
[null,""]
[null,""]
[null,""]
[null,""]
[null,""]
[null,""]
[null,""]
[null,""]
[null,""]
[null,""]
[null,""]
[null,""]
[null,""]
[null,""]
[]
[null,null,null,null,null,null,null,null,null,null,null,null,null,null,null,null,null,null,null,null,null,null,null,null,null,null,null,null,null,null,null,null,null,null,"Totais pagas",{"$f":"SUM(AJ11:AJ510)","v":0},{"$f":"SUM(AK11:AK510)","v":0},0,0,0,{"$f":"SUM(AO11:AO510)","v":0}]

{"sheet":"Guia 6","index":5,"n_rows":512,"n_cols":46,"rows_kept":512,"cut":false,"hidden":true,"merged":[[4,2,4,8],[5,4,5,7],[6,2,6,5],[6,6,6,9],[6,10,6,11],[7,19,8,19],[6,15,6,22],[6,23,6,34],[6,35,6,45],[7,2,8,2],[7,3,8,3],[7,4,8,4],[7,5,8,5],[7,6,8,6],[7,7,8,7],[7,8,8,8],[6,14,8,14],[7,9,8,9],[7,10,8,10],[7,11,8,11],[7,12,8,12],[7,13,8,13],[7,15,8,15],[7,16,8,16],[7,17,8,17],[7,18,8,18],[7,35,7,40],[7,41,7,43],[7,44,7,45],[7,20,8,20],[7,21,8,21],[7,22,8,22],[7,23,7,28],[7,29,7,31],[7,32,7,34]]}
[]
[null,null,"Superior Tribunal de Justiça"]
[null,null,"Secretaria de Processamento de Feitos"]
[null,null,"Coordenadoria de Processamento de Feitos em Execução Judicial"]
[null,null,{"$f":"\"Relação das Requisições de Pequeno Valor - RPV pagas pelo STJ em \"&IF(F11=\"\",\"\",UPPER((TEXT(F11,\"mmmm/aaaa\"))))","v":"Relação das Requisições de Pequeno Valor - RPV pagas pelo STJ em "}]
[]
[null,null,"RPV",null,null,null,"P R O C E S S O     D E     O R I G E M",null,null,null,"E N T I D A D E S",null,"R E Q U E R E N T E","A D V O G A D O","Natureza do crédito","I N D I C A D O R E S",null,null,null,null,null,null,null,"VALORES REQUISITADOS",null,null,null,null,null,null,null,null,null,null,null,"VALORES ATUALIZADOS PARA PAGAMENTO"]
[null,null,"Nº","Registro","Autuada em","data do pgto","Ação","Autuada em","Tipo de causa","Trânsito","Entidade devedora","Órgão de origem","Origem do crédito","Origem do crédito",null,"Tributário","EC 94 2016","Lei 13.463 2017","PRC/RPV de origem","Nº DA GRU","DOENÇA GRAVE","Deficiência física","Isento de IR","Beneficiários",null,null,null,null,null,"PSSS",null,null,"R R A",null,null,"Beneficiários",null,null,null,null,null,"P S S S",null,null,"R R A"]
[null,null,null,null,null,null,null,null,null,null,null,null,null,null,null,null,null,null,null,null,null,null,null,"Total","Adv I","Adv II","Adv III","Adv IV","Requerente","Base","Desc","Patronal","NMA","Exercícios anteriores","Desconto","Total","Adv I","Adv II","Adv III","Adv IV","Reqte","BASE desc","Desc","Patronal","Exercícios anteriores","Dedução"]
[]
[null,{"$f":"IF(C11=\"\",\"\",1)","v":""}]
[null,{"$f":"IF(C12=\"\",\"\",B11+1)","v":""}]
[null,{"$f":"IF(C13=\"\",\"\",B12+1)","v":""}]
[null,""]
[null,""]
[null,""]
[null,""]
[null,""]
[null,""]
[null,""]
[null,""]
[null,""]
[null,""]
[null,""]
[null,""]
[null,""]
[null,""]
[null,""]
[null,""]
[null,""]
[null,""]
[null,""]
[null,""]
[null,""]
[null,""]
[null,""]
[null,""]
[null,""]
[null,""]
[null,""]
[null,""]
[null,""]
[null,""]
[null,""]
[null,""]
[null,""]
[null,""]
[null,""]
[null,""]
[null,""]
[null,""]
[null,""]
[null,""]
[null,""]
[null,""]
[null,""]
[null,""]
[null,""]
[null,""]
[null,""]
[null,""]
[null,""]
[null,""]
[null,""]
[null,""]
[null,""]
[null,""]
[null,""]
[null,""]
[null,""]
[null,""]
[null,""]
[null,""]
[null,""]
[null,""]
[null,""]
[null,{"$f":"IF(C77=\"\",\"\",B76+1)","v":""}]
[null,""]
[null,""]
[null,""]
[null,""]
[null,""]
[null,""]
[null,""]
[null,""]
[null,""]
[null,""]
[null,""]
[null,""]
[null,""]
[null,""]
[null,""]
[null,""]
[null,""]
[null,""]
[null,""]
[null,""]
[null,""]
[null,""]
[null,""]
[null,""]
[null,""]
[null,""]
[null,""]
[null,""]
[null,""]
[null,""]
[null,""]
[null,""]
[null,""]
[null,""]
[null,""]
[null,""]
[null,""]
[null,""]
[null,""]
[null,""]
[null,""]
[null,""]
[null,""]
[null,""]
[null,""]
[null,""]
[null,""]
[null,""]
[null,""]
[null,""]
[null,""]
[null,""]
[null,""]
[null,""]
[null,""]
[null,""]
[null,""]
[null,""]
[null,""]
[null,""]
[null,""]
[null,""]
[null,""]
[null,{"$f":"IF(C141=\"\",\"\",B140+1)","v":""}]
[null,""]
[null,""]
[null,""]
[null,""]
[null,""]
[null,""]
[null,""]
[null,""]
[null,""]
[null,""]
[null,""]
[null,""]
[null,""]
[null,""]
[null,""]
[null,""]
[null,""]
[null,""]
[null,""]
[null,""]
[null,""]
[null,""]
[null,""]
[null,""]
[null,""]
[null,""]
[null,""]
[null,""]
[null,""]
[null,""]
[null,""]
[null,""]
[null,""]
[null,""]
[null,""]
[null,""]
[null,""]
[null,""]
[null,""]
[null,""]
[null,""]
[null,""]
[null,""]
[null,""]
[null,""]
[null,""]
[null,""]
[null,""]
[null,""]
[null,""]
[null,""]
[null,""]
[null,""]
[null,""]
[null,""]
[null,""]
[null,""]
[null,""]
[null,""]
[null,""]
[null,""]
[null,""]
[null,""]
[null,{"$f":"IF(C205=\"\",\"\",B204+1)","v":""}]
[null,""]
[null,""]
[null,""]
[null,""]
[null,""]
[null,""]
[null,""]
[null,""]
[null,""]
[null,""]
[null,""]
[null,""]
[null,""]
[null,""]
[null,""]
[null,""]
[null,""]
[null,""]
[null,""]
[null,""]
[null,""]
[null,""]
[null,""]
[null,""]
[null,""]
[null,""]
[null,""]
[null,""]
[null,""]
[null,""]
[null,""]
[null,""]
[null,""]
[null,""]
[null,""]
[null,""]
[null,""]
[null,""]
[null,""]
[null,""]
[null,""]
[null,""]
[null,""]
[null,""]
[null,""]
[null,""]
[null,""]
[null,""]
[null,""]
[null,""]
[null,""]
[null,""]
[null,""]
[null,""]
[null,""]
[null,""]
[null,""]
[null,""]
[null,""]
[null,""]
[null,""]
[null,""]
[null,""]
[null,{"$f":"IF(C269=\"\",\"\",B268+1)","v":""}]
[null,""]
[null,""]
[null,""]
[null,""]
[null,""]
[null,""]
[null,""]
[null,""]
[null,""]
[null,""]
[null,""]
[null,""]
[null,""]
[null,""]
[null,""]
[null,""]
[null,""]
[null,""]
[null,""]
[null,""]
[null,""]
[null,""]
[null,""]
[null,""]
[null,""]
[null,""]
[null,""]
[null,""]
[null,""]
[null,""]
[null,""]
[null,""]
[null,""]
[null,""]
[null,""]
[null,""]
[null,""]
[null,""]
[null,""]
[null,""]
[null,""]
[null,""]
[null,""]
[null,""]
[null,""]
[null,""]
[null,""]
[null,""]
[null,""]
[null,""]
[null,""]
[null,""]
[null,""]
[null,""]
[null,""]
[null,""]
[null,""]
[null,""]
[null,""]
[null,""]
[null,""]
[null,""]
[null,""]
[null,{"$f":"IF(C333=\"\",\"\",B332+1)","v":""}]
[null,""]
[null,""]
[null,""]
[null,""]
[null,""]
[null,""]
[null,""]
[null,""]
[null,""]
[null,""]
[null,""]
[null,""]
[null,""]
[null,""]
[null,""]
[null,""]
[null,""]
[null,""]
[null,""]
[null,""]
[null,""]
[null,""]
[null,""]
[null,""]
[null,""]
[null,""]
[null,""]
[null,""]
[null,""]
[null,""]
[null,""]
[null,""]
[null,""]
[null,""]
[null,""]
[null,""]
[null,""]
[null,""]
[null,""]
[null,""]
[null,""]
[null,""]
[null,""]
[null,""]
[null,""]
[null,""]
[null,""]
[null,""]
[null,""]
[null,""]
[null,""]
[null,""]
[null,""]
[null,""]
[null,""]
[null,""]
[null,""]
[null,""]
[null,""]
[null,""]
[null,""]
[null,""]
[null,""]
[null,{"$f":"IF(C397=\"\",\"\",B396+1)","v":""}]
[null,""]
[null,""]
[null,""]
[null,""]
[null,""]
[null,""]
[null,""]
[null,""]
[null,""]
[null,""]
[null,""]
[null,""]
[null,""]
[null,""]
[null,""]
[null,""]
[null,""]
[null,""]
[null,""]
[null,""]
[null,""]
[null,""]
[null,""]
[null,""]
[null,""]
[null,""]
[null,""]
[null,""]
[null,""]
[null,""]
[null,""]
[null,""]
[null,""]
[null,""]
[null,""]
[null,""]
[null,""]
[null,""]
[null,""]
[null,""]
[null,""]
[null,""]
[null,""]
[null,""]
[null,""]
[null,""]
[null,""]
[null,""]
[null,""]
[null,""]
[null,""]
[null,""]
[null,""]
[null,""]
[null,""]
[null,""]
[null,""]
[null,""]
[null,""]
[null,""]
[null,""]
[null,""]
[null,""]
[null,{"$f":"IF(C461=\"\",\"\",B460+1)","v":""}]
[null,""]
[null,""]
[null,""]
[null,""]
[null,""]
[null,""]
[null,""]
[null,""]
[null,""]
[null,""]
[null,""]
[null,""]
[null,""]
[null,""]
[null,""]
[null,""]
[null,""]
[null,""]
[null,""]
[null,""]
[null,""]
[null,""]
[null,""]
[null,""]
[null,""]
[null,""]
[null,""]
[null,""]
[null,""]
[null,""]
[null,""]
[null,""]
[null,""]
[null,""]
[null,""]
[null,""]
[null,""]
[null,""]
[null,""]
[null,""]
[null,""]
[null,""]
[null,""]
[null,""]
[null,""]
[null,""]
[null,""]
[null,""]
[null,""]
[]
[null,null,null,null,null,null,null,null,null,null,null,null,null,null,null,null,null,null,null,null,null,null,null,null,null,null,null,null,null,null,null,null,null,null,"Totais pagas",{"$f":"SUM(AJ11:AJ510)","v":0},{"$f":"SUM(AK11:AK510)","v":0},0,0,0,{"$f":"SUM(AO11:AO510)","v":0}]

{"sheet":"Guia 7","index":6,"n_rows":512,"n_cols":46,"rows_kept":512,"cut":false,"hidden":true,"merged":[[4,2,4,8],[5,4,5,7],[6,2,6,5],[6,6,6,9],[6,10,6,11],[7,19,8,19],[6,15,6,22],[6,23,6,34],[6,35,6,45],[7,2,8,2],[7,3,8,3],[7,4,8,4],[7,5,8,5],[7,6,8,6],[7,7,8,7],[7,8,8,8],[6,14,8,14],[7,9,8,9],[7,10,8,10],[7,11,8,11],[7,12,8,12],[7,13,8,13],[7,15,8,15],[7,16,8,16],[7,17,8,17],[7,18,8,18],[7,35,7,40],[7,41,7,43],[7,44,7,45],[7,20,8,20],[7,21,8,21],[7,22,8,22],[7,23,7,28],[7,29,7,31],[7,32,7,34]]}
[]
[null,null,"Superior Tribunal de Justiça"]
[null,null,"Secretaria de Processamento de Feitos"]
[null,null,"Coordenadoria de Processamento de Feitos em Execução Judicial"]
[null,null,{"$f":"\"Relação das Requisições de Pequeno Valor - RPV pagas pelo STJ em \"&IF(F11=\"\",\"\",UPPER((TEXT(F11,\"mmmm/aaaa\"))))","v":"Relação das Requisições de Pequeno Valor - RPV pagas pelo STJ em "}]
[]
[null,null,"RPV",null,null,null,"P R O C E S S O     D E     O R I G E M",null,null,null,"E N T I D A D E S",null,"R E Q U E R E N T E","A D V O G A D O","Natureza do crédito","I N D I C A D O R E S",null,null,null,null,null,null,null,"VALORES REQUISITADOS",null,null,null,null,null,null,null,null,null,null,null,"VALORES ATUALIZADOS PARA PAGAMENTO"]
[null,null,"Nº","Registro","Autuada em","data do pgto","Ação","Autuada em","Tipo de causa","Trânsito","Entidade devedora","Órgão de origem","Origem do crédito","Origem do crédito",null,"Tributário","EC 94 2016","Lei 13.463 2017","PRC/RPV de origem","Nº DA GRU","DOENÇA GRAVE","Deficiência física","Isento de IR","Beneficiários",null,null,null,null,null,"PSSS",null,null,"R R A",null,null,"Beneficiários",null,null,null,null,null,"P S S S",null,null,"R R A"]
[null,null,null,null,null,null,null,null,null,null,null,null,null,null,null,null,null,null,null,null,null,null,null,"Total","Adv I","Adv II","Adv III","Adv IV","Requerente","Base","Desc","Patronal","NMA","Exercícios anteriores","Desconto","Total","Adv I","Adv II","Adv III","Adv IV","Reqte","BASE desc","Desc","Patronal","Exercícios anteriores","Dedução"]
[]
[null,{"$f":"IF(C11=\"\",\"\",1)","v":""}]
[null,{"$f":"IF(C12=\"\",\"\",B11+1)","v":""}]
[null,{"$f":"IF(C13=\"\",\"\",B12+1)","v":""}]
[null,""]
[null,""]
[null,""]
[null,""]
[null,""]
[null,""]
[null,""]
[null,""]
[null,""]
[null,""]
[null,""]
[null,""]
[null,""]
[null,""]
[null,""]
[null,""]
[null,""]
[null,""]
[null,""]
[null,""]
[null,""]
[null,""]
[null,""]
[null,""]
[null,""]
[null,""]
[null,""]
[null,""]
[null,""]
[null,""]
[null,""]
[null,""]
[null,""]
[null,""]
[null,""]
[null,""]
[null,""]
[null,""]
[null,""]
[null,""]
[null,""]
[null,""]
[null,""]
[null,""]
[null,""]
[null,""]
[null,""]
[null,""]
[null,""]
[null,""]
[null,""]
[null,""]
[null,""]
[null,""]
[null,""]
[null,""]
[null,""]
[null,""]
[null,""]
[null,""]
[null,""]
[null,""]
[null,""]
[null,{"$f":"IF(C77=\"\",\"\",B76+1)","v":""}]
[null,""]
[null,""]
[null,""]
[null,""]
[null,""]
[null,""]
[null,""]
[null,""]
[null,""]
[null,""]
[null,""]
[null,""]
[null,""]
[null,""]
[null,""]
[null,""]
[null,""]
[null,""]
[null,""]
[null,""]
[null,""]
[null,""]
[null,""]
[null,""]
[null,""]
[null,""]
[null,""]
[null,""]
[null,""]
[null,""]
[null,""]
[null,""]
[null,""]
[null,""]
[null,""]
[null,""]
[null,""]
[null,""]
[null,""]
[null,""]
[null,""]
[null,""]
[null,""]
[null,""]
[null,""]
[null,""]
[null,""]
[null,""]
[null,""]
[null,""]
[null,""]
[null,""]
[null,""]
[null,""]
[null,""]
[null,""]
[null,""]
[null,""]
[null,""]
[null,""]
[null,""]
[null,""]
[null,""]
[null,{"$f":"IF(C141=\"\",\"\",B140+1)","v":""}]
[null,""]
[null,""]
[null,""]
[null,""]
[null,""]
[null,""]
[null,""]
[null,""]
[null,""]
[null,""]
[null,""]
[null,""]
[null,""]
[null,""]
[null,""]
[null,""]
[null,""]
[null,""]
[null,""]
[null,""]
[null,""]
[null,""]
[null,""]
[null,""]
[null,""]
[null,""]
[null,""]
[null,""]
[null,""]
[null,""]
[null,""]
[null,""]
[null,""]
[null,""]
[null,""]
[null,""]
[null,""]
[null,""]
[null,""]
[null,""]
[null,""]
[null,""]
[null,""]
[null,""]
[null,""]
[null,""]
[null,""]
[null,""]
[null,""]
[null,""]
[null,""]
[null,""]
[null,""]
[null,""]
[null,""]
[null,""]
[null,""]
[null,""]
[null,""]
[null,""]
[null,""]
[null,""]
[null,""]
[null,{"$f":"IF(C205=\"\",\"\",B204+1)","v":""}]
[null,""]
[null,""]
[null,""]
[null,""]
[null,""]
[null,""]
[null,""]
[null,""]
[null,""]
[null,""]
[null,""]
[null,""]
[null,""]
[null,""]
[null,""]
[null,""]
[null,""]
[null,""]
[null,""]
[null,""]
[null,""]
[null,""]
[null,""]
[null,""]
[null,""]
[null,""]
[null,""]
[null,""]
[null,""]
[null,""]
[null,""]
[null,""]
[null,""]
[null,""]
[null,""]
[null,""]
[null,""]
[null,""]
[null,""]
[null,""]
[null,""]
[null,""]
[null,""]
[null,""]
[null,""]
[null,""]
[null,""]
[null,""]
[null,""]
[null,""]
[null,""]
[null,""]
[null,""]
[null,""]
[null,""]
[null,""]
[null,""]
[null,""]
[null,""]
[null,""]
[null,""]
[null,""]
[null,""]
[null,{"$f":"IF(C269=\"\",\"\",B268+1)","v":""}]
[null,""]
[null,""]
[null,""]
[null,""]
[null,""]
[null,""]
[null,""]
[null,""]
[null,""]
[null,""]
[null,""]
[null,""]
[null,""]
[null,""]
[null,""]
[null,""]
[null,""]
[null,""]
[null,""]
[null,""]
[null,""]
[null,""]
[null,""]
[null,""]
[null,""]
[null,""]
[null,""]
[null,""]
[null,""]
[null,""]
[null,""]
[null,""]
[null,""]
[null,""]
[null,""]
[null,""]
[null,""]
[null,""]
[null,""]
[null,""]
[null,""]
[null,""]
[null,""]
[null,""]
[null,""]
[null,""]
[null,""]
[null,""]
[null,""]
[null,""]
[null,""]
[null,""]
[null,""]
[null,""]
[null,""]
[null,""]
[null,""]
[null,""]
[null,""]
[null,""]
[null,""]
[null,""]
[null,""]
[null,{"$f":"IF(C333=\"\",\"\",B332+1)","v":""}]
[null,""]
[null,""]
[null,""]
[null,""]
[null,""]
[null,""]
[null,""]
[null,""]
[null,""]
[null,""]
[null,""]
[null,""]
[null,""]
[null,""]
[null,""]
[null,""]
[null,""]
[null,""]
[null,""]
[null,""]
[null,""]
[null,""]
[null,""]
[null,""]
[null,""]
[null,""]
[null,""]
[null,""]
[null,""]
[null,""]
[null,""]
[null,""]
[null,""]
[null,""]
[null,""]
[null,""]
[null,""]
[null,""]
[null,""]
[null,""]
[null,""]
[null,""]
[null,""]
[null,""]
[null,""]
[null,""]
[null,""]
[null,""]
[null,""]
[null,""]
[null,""]
[null,""]
[null,""]
[null,""]
[null,""]
[null,""]
[null,""]
[null,""]
[null,""]
[null,""]
[null,""]
[null,""]
[null,""]
[null,{"$f":"IF(C397=\"\",\"\",B396+1)","v":""}]
[null,""]
[null,""]
[null,""]
[null,""]
[null,""]
[null,""]
[null,""]
[null,""]
[null,""]
[null,""]
[null,""]
[null,""]
[null,""]
[null,""]
[null,""]
[null,""]
[null,""]
[null,""]
[null,""]
[null,""]
[null,""]
[null,""]
[null,""]
[null,""]
[null,""]
[null,""]
[null,""]
[null,""]
[null,""]
[null,""]
[null,""]
[null,""]
[null,""]
[null,""]
[null,""]
[null,""]
[null,""]
[null,""]
[null,""]
[null,""]
[null,""]
[null,""]
[null,""]
[null,""]
[null,""]
[null,""]
[null,""]
[null,""]
[null,""]
[null,""]
[null,""]
[null,""]
[null,""]
[null,""]
[null,""]
[null,""]
[null,""]
[null,""]
[null,""]
[null,""]
[null,""]
[null,""]
[null,""]
[null,{"$f":"IF(C461=\"\",\"\",B460+1)","v":""}]
[null,""]
[null,""]
[null,""]
[null,""]
[null,""]
[null,""]
[null,""]
[null,""]
[null,""]
[null,""]
[null,""]
[null,""]
[null,""]
[null,""]
[null,""]
[null,""]
[null,""]
[null,""]
[null,""]
[null,""]
[null,""]
[null,""]
[null,""]
[null,""]
[null,""]
[null,""]
[null,""]
[null,""]
[null,""]
[null,""]
[null,""]
[null,""]
[null,""]
[null,""]
[null,""]
[null,""]
[null,""]
[null,""]
[null,""]
[null,""]
[null,""]
[null,""]
[null,""]
[null,""]
[null,""]
[null,""]
[null,""]
[null,""]
[null,""]
[]
[null,null,null,null,null,null,null,null,null,null,null,null,null,null,null,null,null,null,null,null,null,null,null,null,null,null,null,null,null,null,null,null,null,null,"Totais pagas",{"$f":"SUM(AJ11:AJ510)","v":0},{"$f":"SUM(AK11:AK510)","v":0},0,0,0,{"$f":"SUM(AO11:AO510)","v":0}]

{"sheet":"Guia 8","index":7,"n_rows":512,"n_cols":46,"rows_kept":512,"cut":false,"hidden":true,"merged":[[4,2,4,8],[5,4,5,7],[6,2,6,5],[6,6,6,9],[6,10,6,11],[7,19,8,19],[6,15,6,22],[6,23,6,34],[6,35,6,45],[7,2,8,2],[7,3,8,3],[7,4,8,4],[7,5,8,5],[7,6,8,6],[7,7,8,7],[7,8,8,8],[6,14,8,14],[7,9,8,9],[7,10,8,10],[7,11,8,11],[7,12,8,12],[7,13,8,13],[7,15,8,15],[7,16,8,16],[7,17,8,17],[7,18,8,18],[7,35,7,40],[7,41,7,43],[7,44,7,45],[7,20,8,20],[7,21,8,21],[7,22,8,22],[7,23,7,28],[7,29,7,31],[7,32,7,34]]}
[]
[null,null,"Superior Tribunal de Justiça"]
[null,null,"Secretaria de Processamento de Feitos"]
[null,null,"Coordenadoria de Processamento de Feitos em Execução Judicial"]
[null,null,{"$f":"\"Relação das Requisições de Pequeno Valor - RPV pagas pelo STJ em \"&IF(F11=\"\",\"\",UPPER((TEXT(F11,\"mmmm/aaaa\"))))","v":"Relação das Requisições de Pequeno Valor - RPV pagas pelo STJ em "}]
[]
[null,null,"RPV",null,null,null,"P R O C E S S O     D E     O R I G E M",null,null,null,"E N T I D A D E S",null,"R E Q U E R E N T E","A D V O G A D O","Natureza do crédito","I N D I C A D O R E S",null,null,null,null,null,null,null,"VALORES REQUISITADOS",null,null,null,null,null,null,null,null,null,null,null,"VALORES ATUALIZADOS PARA PAGAMENTO"]
[null,null,"Nº","Registro","Autuada em","data do pgto","Ação","Autuada em","Tipo de causa","Trânsito","Entidade devedora","Órgão de origem","Origem do crédito","Origem do crédito",null,"Tributário","EC 94 2016","Lei 13.463 2017","PRC/RPV de origem","Nº DA GRU","DOENÇA GRAVE","Deficiência física","Isento de IR","Beneficiários",null,null,null,null,null,"PSSS",null,null,"R R A",null,null,"Beneficiários",null,null,null,null,null,"P S S S",null,null,"R R A"]
[null,null,null,null,null,null,null,null,null,null,null,null,null,null,null,null,null,null,null,null,null,null,null,"Total","Adv I","Adv II","Adv III","Adv IV","Requerente","Base","Desc","Patronal","NMA","Exercícios anteriores","Desconto","Total","Adv I","Adv II","Adv III","Adv IV","Reqte","BASE desc","Desc","Patronal","Exercícios anteriores","Dedução"]
[]
[null,{"$f":"IF(C11=\"\",\"\",1)","v":""}]
[null,{"$f":"IF(C12=\"\",\"\",B11+1)","v":""}]
[null,{"$f":"IF(C13=\"\",\"\",B12+1)","v":""}]
[null,""]
[null,""]
[null,""]
[null,""]
[null,""]
[null,""]
[null,""]
[null,""]
[null,""]
[null,""]
[null,""]
[null,""]
[null,""]
[null,""]
[null,""]
[null,""]
[null,""]
[null,""]
[null,""]
[null,""]
[null,""]
[null,""]
[null,""]
[null,""]
[null,""]
[null,""]
[null,""]
[null,""]
[null,""]
[null,""]
[null,""]
[null,""]
[null,""]
[null,""]
[null,""]
[null,""]
[null,""]
[null,""]
[null,""]
[null,""]
[null,""]
[null,""]
[null,""]
[null,""]
[null,""]
[null,""]
[null,""]
[null,""]
[null,""]
[null,""]
[null,""]
[null,""]
[null,""]
[null,""]
[null,""]
[null,""]
[null,""]
[null,""]
[null,""]
[null,""]
[null,""]
[null,""]
[null,""]
[null,{"$f":"IF(C77=\"\",\"\",B76+1)","v":""}]
[null,""]
[null,""]
[null,""]
[null,""]
[null,""]
[null,""]
[null,""]
[null,""]
[null,""]
[null,""]
[null,""]
[null,""]
[null,""]
[null,""]
[null,""]
[null,""]
[null,""]
[null,""]
[null,""]
[null,""]
[null,""]
[null,""]
[null,""]
[null,""]
[null,""]
[null,""]
[null,""]
[null,""]
[null,""]
[null,""]
[null,""]
[null,""]
[null,""]
[null,""]
[null,""]
[null,""]
[null,""]
[null,""]
[null,""]
[null,""]
[null,""]
[null,""]
[null,""]
[null,""]
[null,""]
[null,""]
[null,""]
[null,""]
[null,""]
[null,""]
[null,""]
[null,""]
[null,""]
[null,""]
[null,""]
[null,""]
[null,""]
[null,""]
[null,""]
[null,""]
[null,""]
[null,""]
[null,""]
[null,{"$f":"IF(C141=\"\",\"\",B140+1)","v":""}]
[null,""]
[null,""]
[null,""]
[null,""]
[null,""]
[null,""]
[null,""]
[null,""]
[null,""]
[null,""]
[null,""]
[null,""]
[null,""]
[null,""]
[null,""]
[null,""]
[null,""]
[null,""]
[null,""]
[null,""]
[null,""]
[null,""]
[null,""]
[null,""]
[null,""]
[null,""]
[null,""]
[null,""]
[null,""]
[null,""]
[null,""]
[null,""]
[null,""]
[null,""]
[null,""]
[null,""]
[null,""]
[null,""]
[null,""]
[null,""]
[null,""]
[null,""]
[null,""]
[null,""]
[null,""]
[null,""]
[null,""]
[null,""]
[null,""]
[null,""]
[null,""]
[null,""]
[null,""]
[null,""]
[null,""]
[null,""]
[null,""]
[null,""]
[null,""]
[null,""]
[null,""]
[null,""]
[null,""]
[null,{"$f":"IF(C205=\"\",\"\",B204+1)","v":""}]
[null,""]
[null,""]
[null,""]
[null,""]
[null,""]
[null,""]
[null,""]
[null,""]
[null,""]
[null,""]
[null,""]
[null,""]
[null,""]
[null,""]
[null,""]
[null,""]
[null,""]
[null,""]
[null,""]
[null,""]
[null,""]
[null,""]
[null,""]
[null,""]
[null,""]
[null,""]
[null,""]
[null,""]
[null,""]
[null,""]
[null,""]
[null,""]
[null,""]
[null,""]
[null,""]
[null,""]
[null,""]
[null,""]
[null,""]
[null,""]
[null,""]
[null,""]
[null,""]
[null,""]
[null,""]
[null,""]
[null,""]
[null,""]
[null,""]
[null,""]
[null,""]
[null,""]
[null,""]
[null,""]
[null,""]
[null,""]
[null,""]
[null,""]
[null,""]
[null,""]
[null,""]
[null,""]
[null,""]
[null,{"$f":"IF(C269=\"\",\"\",B268+1)","v":""}]
[null,""]
[null,""]
[null,""]
[null,""]
[null,""]
[null,""]
[null,""]
[null,""]
[null,""]
[null,""]
[null,""]
[null,""]
[null,""]
[null,""]
[null,""]
[null,""]
[null,""]
[null,""]
[null,""]
[null,""]
[null,""]
[null,""]
[null,""]
[null,""]
[null,""]
[null,""]
[null,""]
[null,""]
[null,""]
[null,""]
[null,""]
[null,""]
[null,""]
[null,""]
[null,""]
[null,""]
[null,""]
[null,""]
[null,""]
[null,""]
[null,""]
[null,""]
[null,""]
[null,""]
[null,""]
[null,""]
[null,""]
[null,""]
[null,""]
[null,""]
[null,""]
[null,""]
[null,""]
[null,""]
[null,""]
[null,""]
[null,""]
[null,""]
[null,""]
[null,""]
[null,""]
[null,""]
[null,""]
[null,{"$f":"IF(C333=\"\",\"\",B332+1)","v":""}]
[null,""]
[null,""]
[null,""]
[null,""]
[null,""]
[null,""]
[null,""]
[null,""]
[null,""]
[null,""]
[null,""]
[null,""]
[null,""]
[null,""]
[null,""]
[null,""]
[null,""]
[null,""]
[null,""]
[null,""]
[null,""]
[null,""]
[null,""]
[null,""]
[null,""]
[null,""]
[null,""]
[null,""]
[null,""]
[null,""]
[null,""]
[null,""]
[null,""]
[null,""]
[null,""]
[null,""]
[null,""]
[null,""]
[null,""]
[null,""]
[null,""]
[null,""]
[null,""]
[null,""]
[null,""]
[null,""]
[null,""]
[null,""]
[null,""]
[null,""]
[null,""]
[null,""]
[null,""]
[null,""]
[null,""]
[null,""]
[null,""]
[null,""]
[null,""]
[null,""]
[null,""]
[null,""]
[null,""]
[null,{"$f":"IF(C397=\"\",\"\",B396+1)","v":""}]
[null,""]
[null,""]
[null,""]
[null,""]
[null,""]
[null,""]
[null,""]
[null,""]
[null,""]
[null,""]
[null,""]
[null,""]
[null,""]
[null,""]
[null,""]
[null,""]
[null,""]
[null,""]
[null,""]
[null,""]
[null,""]
[null,""]
[null,""]
[null,""]
[null,""]
[null,""]
[null,""]
[null,""]
[null,""]
[null,""]
[null,""]
[null,""]
[null,""]
[null,""]
[null,""]
[null,""]
[null,""]
[null,""]
[null,""]
[null,""]
[null,""]
[null,""]
[null,""]
[null,""]
[null,""]
[null,""]
[null,""]
[null,""]
[null,""]
[null,""]
[null,""]
[null,""]
[null,""]
[null,""]
[null,""]
[null,""]
[null,""]
[null,""]
[null,""]
[null,""]
[null,""]
[null,""]
[null,""]
[null,{"$f":"IF(C461=\"\",\"\",B460+1)","v":""}]
[null,""]
[null,""]
[null,""]
[null,""]
[null,""]
[null,""]
[null,""]
[null,""]
[null,""]
[null,""]
[null,""]
[null,""]
[null,""]
[null,""]
[null,""]
[null,""]
[null,""]
[null,""]
[null,""]
[null,""]
[null,""]
[null,""]
[null,""]
[null,""]
[null,""]
[null,""]
[null,""]
[null,""]
[null,""]
[null,""]
[null,""]
[null,""]
[null,""]
[null,""]
[null,""]
[null,""]
[null,""]
[null,""]
[null,""]
[null,""]
[null,""]
[null,""]
[null,""]
[null,""]
[null,""]
[null,""]
[null,""]
[null,""]
[null,""]
[]
[null,null,null,null,null,null,null,null,null,null,null,null,null,null,null,null,null,null,null,null,null,null,null,null,null,null,null,null,null,null,null,null,null,null,"Totais pagas",{"$f":"SUM(AJ11:AJ510)","v":0},{"$f":"SUM(AK11:AK510)","v":0},0,0,0,{"$f":"SUM(AO11:AO510)","v":0}]

{"sheet":"Guia 9","index":8,"n_rows":512,"n_cols":46,"rows_kept":512,"cut":false,"hidden":true,"merged":[[4,2,4,8],[5,4,5,7],[6,2,6,5],[6,6,6,9],[6,10,6,11],[7,19,8,19],[6,15,6,22],[6,23,6,34],[6,35,6,45],[7,2,8,2],[7,3,8,3],[7,4,8,4],[7,5,8,5],[7,6,8,6],[7,7,8,7],[7,8,8,8],[6,14,8,14],[7,9,8,9],[7,10,8,10],[7,11,8,11],[7,12,8,12],[7,13,8,13],[7,15,8,15],[7,16,8,16],[7,17,8,17],[7,18,8,18],[7,35,7,40],[7,41,7,43],[7,44,7,45],[7,20,8,20],[7,21,8,21],[7,22,8,22],[7,23,7,28],[7,29,7,31],[7,32,7,34]]}
[]
[null,null,"Superior Tribunal de Justiça"]
[null,null,"Secretaria de Processamento de Feitos"]
[null,null,"Coordenadoria de Processamento de Feitos em Execução Judicial"]
[null,null,{"$f":"\"Relação das Requisições de Pequeno Valor - RPV pagas pelo STJ em \"&IF(F11=\"\",\"\",UPPER((TEXT(F11,\"mmmm/aaaa\"))))","v":"Relação das Requisições de Pequeno Valor - RPV pagas pelo STJ em "}]
[]
[null,null,"RPV",null,null,null,"P R O C E S S O     D E     O R I G E M",null,null,null,"E N T I D A D E S",null,"R E Q U E R E N T E","A D V O G A D O","Natureza do crédito","I N D I C A D O R E S",null,null,null,null,null,null,null,"VALORES REQUISITADOS",null,null,null,null,null,null,null,null,null,null,null,"VALORES ATUALIZADOS PARA PAGAMENTO"]
[null,null,"Nº","Registro","Autuada em","data do pgto","Ação","Autuada em","Tipo de causa","Trânsito","Entidade devedora","Órgão de origem","Origem do crédito","Origem do crédito",null,"Tributário","EC 94 2016","Lei 13.463 2017","PRC/RPV de origem","Nº DA GRU","DOENÇA GRAVE","Deficiência física","Isento de IR","Beneficiários",null,null,null,null,null,"PSSS",null,null,"R R A",null,null,"Beneficiários",null,null,null,null,null,"P S S S",null,null,"R R A"]
[null,null,null,null,null,null,null,null,null,null,null,null,null,null,null,null,null,null,null,null,null,null,null,"Total","Adv I","Adv II","Adv III","Adv IV","Requerente","Base","Desc","Patronal","NMA","Exercícios anteriores","Desconto","Total","Adv I","Adv II","Adv III","Adv IV","Reqte","BASE desc","Desc","Patronal","Exercícios anteriores","Dedução"]
[]
[null,{"$f":"IF(C11=\"\",\"\",1)","v":""}]
[null,{"$f":"IF(C12=\"\",\"\",B11+1)","v":""}]
[null,{"$f":"IF(C13=\"\",\"\",B12+1)","v":""}]
[null,""]
[null,""]
[null,""]
[null,""]
[null,""]
[null,""]
[null,""]
[null,""]
[null,""]
[null,""]
[null,""]
[null,""]
[null,""]
[null,""]
[null,""]
[null,""]
[null,""]
[null,""]
[null,""]
[null,""]
[null,""]
[null,""]
[null,""]
[null,""]
[null,""]
[null,""]
[null,""]
[null,""]
[null,""]
[null,""]
[null,""]
[null,""]
[null,""]
[null,""]
[null,""]
[null,""]
[null,""]
[null,""]
[null,""]
[null,""]
[null,""]
[null,""]
[null,""]
[null,""]
[null,""]
[null,""]
[null,""]
[null,""]
[null,""]
[null,""]
[null,""]
[null,""]
[null,""]
[null,""]
[null,""]
[null,""]
[null,""]
[null,""]
[null,""]
[null,""]
[null,""]
[null,""]
[null,""]
[null,{"$f":"IF(C77=\"\",\"\",B76+1)","v":""}]
[null,""]
[null,""]
[null,""]
[null,""]
[null,""]
[null,""]
[null,""]
[null,""]
[null,""]
[null,""]
[null,""]
[null,""]
[null,""]
[null,""]
[null,""]
[null,""]
[null,""]
[null,""]
[null,""]
[null,""]
[null,""]
[null,""]
[null,""]
[null,""]
[null,""]
[null,""]
[null,""]
[null,""]
[null,""]
[null,""]
[null,""]
[null,""]
[null,""]
[null,""]
[null,""]
[null,""]
[null,""]
[null,""]
[null,""]
[null,""]
[null,""]
[null,""]
[null,""]
[null,""]
[null,""]
[null,""]
[null,""]
[null,""]
[null,""]
[null,""]
[null,""]
[null,""]
[null,""]
[null,""]
[null,""]
[null,""]
[null,""]
[null,""]
[null,""]
[null,""]
[null,""]
[null,""]
[null,""]
[null,{"$f":"IF(C141=\"\",\"\",B140+1)","v":""}]
[null,""]
[null,""]
[null,""]
[null,""]
[null,""]
[null,""]
[null,""]
[null,""]
[null,""]
[null,""]
[null,""]
[null,""]
[null,""]
[null,""]
[null,""]
[null,""]
[null,""]
[null,""]
[null,""]
[null,""]
[null,""]
[null,""]
[null,""]
[null,""]
[null,""]
[null,""]
[null,""]
[null,""]
[null,""]
[null,""]
[null,""]
[null,""]
[null,""]
[null,""]
[null,""]
[null,""]
[null,""]
[null,""]
[null,""]
[null,""]
[null,""]
[null,""]
[null,""]
[null,""]
[null,""]
[null,""]
[null,""]
[null,""]
[null,""]
[null,""]
[null,""]
[null,""]
[null,""]
[null,""]
[null,""]
[null,""]
[null,""]
[null,""]
[null,""]
[null,""]
[null,""]
[null,""]
[null,""]
[null,{"$f":"IF(C205=\"\",\"\",B204+1)","v":""}]
[null,""]
[null,""]
[null,""]
[null,""]
[null,""]
[null,""]
[null,""]
[null,""]
[null,""]
[null,""]
[null,""]
[null,""]
[null,""]
[null,""]
[null,""]
[null,""]
[null,""]
[null,""]
[null,""]
[null,""]
[null,""]
[null,""]
[null,""]
[null,""]
[null,""]
[null,""]
[null,""]
[null,""]
[null,""]
[null,""]
[null,""]
[null,""]
[null,""]
[null,""]
[null,""]
[null,""]
[null,""]
[null,""]
[null,""]
[null,""]
[null,""]
[null,""]
[null,""]
[null,""]
[null,""]
[null,""]
[null,""]
[null,""]
[null,""]
[null,""]
[null,""]
[null,""]
[null,""]
[null,""]
[null,""]
[null,""]
[null,""]
[null,""]
[null,""]
[null,""]
[null,""]
[null,""]
[null,""]
[null,{"$f":"IF(C269=\"\",\"\",B268+1)","v":""}]
[null,""]
[null,""]
[null,""]
[null,""]
[null,""]
[null,""]
[null,""]
[null,""]
[null,""]
[null,""]
[null,""]
[null,""]
[null,""]
[null,""]
[null,""]
[null,""]
[null,""]
[null,""]
[null,""]
[null,""]
[null,""]
[null,""]
[null,""]
[null,""]
[null,""]
[null,""]
[null,""]
[null,""]
[null,""]
[null,""]
[null,""]
[null,""]
[null,""]
[null,""]
[null,""]
[null,""]
[null,""]
[null,""]
[null,""]
[null,""]
[null,""]
[null,""]
[null,""]
[null,""]
[null,""]
[null,""]
[null,""]
[null,""]
[null,""]
[null,""]
[null,""]
[null,""]
[null,""]
[null,""]
[null,""]
[null,""]
[null,""]
[null,""]
[null,""]
[null,""]
[null,""]
[null,""]
[null,""]
[null,{"$f":"IF(C333=\"\",\"\",B332+1)","v":""}]
[null,""]
[null,""]
[null,""]
[null,""]
[null,""]
[null,""]
[null,""]
[null,""]
[null,""]
[null,""]
[null,""]
[null,""]
[null,""]
[null,""]
[null,""]
[null,""]
[null,""]
[null,""]
[null,""]
[null,""]
[null,""]
[null,""]
[null,""]
[null,""]
[null,""]
[null,""]
[null,""]
[null,""]
[null,""]
[null,""]
[null,""]
[null,""]
[null,""]
[null,""]
[null,""]
[null,""]
[null,""]
[null,""]
[null,""]
[null,""]
[null,""]
[null,""]
[null,""]
[null,""]
[null,""]
[null,""]
[null,""]
[null,""]
[null,""]
[null,""]
[null,""]
[null,""]
[null,""]
[null,""]
[null,""]
[null,""]
[null,""]
[null,""]
[null,""]
[null,""]
[null,""]
[null,""]
[null,""]
[null,{"$f":"IF(C397=\"\",\"\",B396+1)","v":""}]
[null,""]
[null,""]
[null,""]
[null,""]
[null,""]
[null,""]
[null,""]
[null,""]
[null,""]
[null,""]
[null,""]
[null,""]
[null,""]
[null,""]
[null,""]
[null,""]
[null,""]
[null,""]
[null,""]
[null,""]
[null,""]
[null,""]
[null,""]
[null,""]
[null,""]
[null,""]
[null,""]
[null,""]
[null,""]
[null,""]
[null,""]
[null,""]
[null,""]
[null,""]
[null,""]
[null,""]
[null,""]
[null,""]
[null,""]
[null,""]
[null,""]
[null,""]
[null,""]
[null,""]
[null,""]
[null,""]
[null,""]
[null,""]
[null,""]
[null,""]
[null,""]
[null,""]
[null,""]
[null,""]
[null,""]
[null,""]
[null,""]
[null,""]
[null,""]
[null,""]
[null,""]
[null,""]
[null,""]
[null,{"$f":"IF(C461=\"\",\"\",B460+1)","v":""}]
[null,""]
[null,""]
[null,""]
[null,""]
[null,""]
[null,""]
[null,""]
[null,""]
[null,""]
[null,""]
[null,""]
[null,""]
[null,""]
[null,""]
[null,""]
[null,""]
[null,""]
[null,""]
[null,""]
[null,""]
[null,""]
[null,""]
[null,""]
[null,""]
[null,""]
[null,""]
[null,""]
[null,""]
[null,""]
[null,""]
[null,""]
[null,""]
[null,""]
[null,""]
[null,""]
[null,""]
[null,""]
[null,""]
[null,""]
[null,""]
[null,""]
[null,""]
[null,""]
[null,""]
[null,""]
[null,""]
[null,""]
[null,""]
[null,""]
[]
[null,null,null,null,null,null,null,null,null,null,null,null,null,null,null,null,null,null,null,null,null,null,null,null,null,null,null,null,null,null,null,null,null,null,"Totais pagas",{"$f":"SUM(AJ11:AJ510)","v":0},{"$f":"SUM(AK11:AK510)","v":0},0,0,0,{"$f":"SUM(AO11:AO510)","v":0}]

{"sheet":"Guia 10","index":9,"n_rows":512,"n_cols":46,"rows_kept":512,"cut":false,"hidden":true,"merged":[[4,2,4,8],[5,4,5,7],[6,2,6,5],[6,6,6,9],[6,10,6,11],[7,19,8,19],[6,15,6,22],[6,23,6,34],[6,35,6,45],[7,2,8,2],[7,3,8,3],[7,4,8,4],[7,5,8,5],[7,6,8,6],[7,7,8,7],[7,8,8,8],[6,14,8,14],[7,9,8,9],[7,10,8,10],[7,11,8,11],[7,12,8,12],[7,13,8,13],[7,15,8,15],[7,16,8,16],[7,17,8,17],[7,18,8,18],[7,35,7,40],[7,41,7,43],[7,44,7,45],[7,20,8,20],[7,21,8,21],[7,22,8,22],[7,23,7,28],[7,29,7,31],[7,32,7,34]]}
[]
[null,null,"Superior Tribunal de Justiça"]
[null,null,"Secretaria de Processamento de Feitos"]
[null,null,"Coordenadoria de Processamento de Feitos em Execução Judicial"]
[null,null,{"$f":"\"Relação das Requisições de Pequeno Valor - RPV pagas pelo STJ em \"&IF(F11=\"\",\"\",UPPER((TEXT(F11,\"mmmm/aaaa\"))))","v":"Relação das Requisições de Pequeno Valor - RPV pagas pelo STJ em "}]
[]
[null,null,"RPV",null,null,null,"P R O C E S S O     D E     O R I G E M",null,null,null,"E N T I D A D E S",null,"R E Q U E R E N T E","A D V O G A D O","Natureza do crédito","I N D I C A D O R E S",null,null,null,null,null,null,null,"VALORES REQUISITADOS",null,null,null,null,null,null,null,null,null,null,null,"VALORES ATUALIZADOS PARA PAGAMENTO"]
[null,null,"Nº","Registro","Autuada em","data do pgto","Ação","Autuada em","Tipo de causa","Trânsito","Entidade devedora","Órgão de origem","Origem do crédito","Origem do crédito",null,"Tributário","EC 94 2016","Lei 13.463 2017","PRC/RPV de origem","Nº DA GRU","DOENÇA GRAVE","Deficiência física","Isento de IR","Beneficiários",null,null,null,null,null,"PSSS",null,null,"R R A",null,null,"Beneficiários",null,null,null,null,null,"P S S S",null,null,"R R A"]
[null,null,null,null,null,null,null,null,null,null,null,null,null,null,null,null,null,null,null,null,null,null,null,"Total","Adv I","Adv II","Adv III","Adv IV","Requerente","Base","Desc","Patronal","NMA","Exercícios anteriores","Desconto","Total","Adv I","Adv II","Adv III","Adv IV","Reqte","BASE desc","Desc","Patronal","Exercícios anteriores","Dedução"]
[]
[null,{"$f":"IF(C11=\"\",\"\",1)","v":""}]
[null,{"$f":"IF(C12=\"\",\"\",B11+1)","v":""}]
[null,{"$f":"IF(C13=\"\",\"\",B12+1)","v":""}]
[null,""]
[null,""]
[null,""]
[null,""]
[null,""]
[null,""]
[null,""]
[null,""]
[null,""]
[null,""]
[null,""]
[null,""]
[null,""]
[null,""]
[null,""]
[null,""]
[null,""]
[null,""]
[null,""]
[null,""]
[null,""]
[null,""]
[null,""]
[null,""]
[null,""]
[null,""]
[null,""]
[null,""]
[null,""]
[null,""]
[null,""]
[null,""]
[null,""]
[null,""]
[null,""]
[null,""]
[null,""]
[null,""]
[null,""]
[null,""]
[null,""]
[null,""]
[null,""]
[null,""]
[null,""]
[null,""]
[null,""]
[null,""]
[null,""]
[null,""]
[null,""]
[null,""]
[null,""]
[null,""]
[null,""]
[null,""]
[null,""]
[null,""]
[null,""]
[null,""]
[null,""]
[null,""]
[null,""]
[null,{"$f":"IF(C77=\"\",\"\",B76+1)","v":""}]
[null,""]
[null,""]
[null,""]
[null,""]
[null,""]
[null,""]
[null,""]
[null,""]
[null,""]
[null,""]
[null,""]
[null,""]
[null,""]
[null,""]
[null,""]
[null,""]
[null,""]
[null,""]
[null,""]
[null,""]
[null,""]
[null,""]
[null,""]
[null,""]
[null,""]
[null,""]
[null,""]
[null,""]
[null,""]
[null,""]
[null,""]
[null,""]
[null,""]
[null,""]
[null,""]
[null,""]
[null,""]
[null,""]
[null,""]
[null,""]
[null,""]
[null,""]
[null,""]
[null,""]
[null,""]
[null,""]
[null,""]
[null,""]
[null,""]
[null,""]
[null,""]
[null,""]
[null,""]
[null,""]
[null,""]
[null,""]
[null,""]
[null,""]
[null,""]
[null,""]
[null,""]
[null,""]
[null,""]
[null,{"$f":"IF(C141=\"\",\"\",B140+1)","v":""}]
[null,""]
[null,""]
[null,""]
[null,""]
[null,""]
[null,""]
[null,""]
[null,""]
[null,""]
[null,""]
[null,""]
[null,""]
[null,""]
[null,""]
[null,""]
[null,""]
[null,""]
[null,""]
[null,""]
[null,""]
[null,""]
[null,""]
[null,""]
[null,""]
[null,""]
[null,""]
[null,""]
[null,""]
[null,""]
[null,""]
[null,""]
[null,""]
[null,""]
[null,""]
[null,""]
[null,""]
[null,""]
[null,""]
[null,""]
[null,""]
[null,""]
[null,""]
[null,""]
[null,""]
[null,""]
[null,""]
[null,""]
[null,""]
[null,""]
[null,""]
[null,""]
[null,""]
[null,""]
[null,""]
[null,""]
[null,""]
[null,""]
[null,""]
[null,""]
[null,""]
[null,""]
[null,""]
[null,""]
[null,{"$f":"IF(C205=\"\",\"\",B204+1)","v":""}]
[null,""]
[null,""]
[null,""]
[null,""]
[null,""]
[null,""]
[null,""]
[null,""]
[null,""]
[null,""]
[null,""]
[null,""]
[null,""]
[null,""]
[null,""]
[null,""]
[null,""]
[null,""]
[null,""]
[null,""]
[null,""]
[null,""]
[null,""]
[null,""]
[null,""]
[null,""]
[null,""]
[null,""]
[null,""]
[null,""]
[null,""]
[null,""]
[null,""]
[null,""]
[null,""]
[null,""]
[null,""]
[null,""]
[null,""]
[null,""]
[null,""]
[null,""]
[null,""]
[null,""]
[null,""]
[null,""]
[null,""]
[null,""]
[null,""]
[null,""]
[null,""]
[null,""]
[null,""]
[null,""]
[null,""]
[null,""]
[null,""]
[null,""]
[null,""]
[null,""]
[null,""]
[null,""]
[null,""]
[null,{"$f":"IF(C269=\"\",\"\",B268+1)","v":""}]
[null,""]
[null,""]
[null,""]
[null,""]
[null,""]
[null,""]
[null,""]
[null,""]
[null,""]
[null,""]
[null,""]
[null,""]
[null,""]
[null,""]
[null,""]
[null,""]
[null,""]
[null,""]
[null,""]
[null,""]
[null,""]
[null,""]
[null,""]
[null,""]
[null,""]
[null,""]
[null,""]
[null,""]
[null,""]
[null,""]
[null,""]
[null,""]
[null,""]
[null,""]
[null,""]
[null,""]
[null,""]
[null,""]
[null,""]
[null,""]
[null,""]
[null,""]
[null,""]
[null,""]
[null,""]
[null,""]
[null,""]
[null,""]
[null,""]
[null,""]
[null,""]
[null,""]
[null,""]
[null,""]
[null,""]
[null,""]
[null,""]
[null,""]
[null,""]
[null,""]
[null,""]
[null,""]
[null,""]
[null,{"$f":"IF(C333=\"\",\"\",B332+1)","v":""}]
[null,""]
[null,""]
[null,""]
[null,""]
[null,""]
[null,""]
[null,""]
[null,""]
[null,""]
[null,""]
[null,""]
[null,""]
[null,""]
[null,""]
[null,""]
[null,""]
[null,""]
[null,""]
[null,""]
[null,""]
[null,""]
[null,""]
[null,""]
[null,""]
[null,""]
[null,""]
[null,""]
[null,""]
[null,""]
[null,""]
[null,""]
[null,""]
[null,""]
[null,""]
[null,""]
[null,""]
[null,""]
[null,""]
[null,""]
[null,""]
[null,""]
[null,""]
[null,""]
[null,""]
[null,""]
[null,""]
[null,""]
[null,""]
[null,""]
[null,""]
[null,""]
[null,""]
[null,""]
[null,""]
[null,""]
[null,""]
[null,""]
[null,""]
[null,""]
[null,""]
[null,""]
[null,""]
[null,""]
[null,{"$f":"IF(C397=\"\",\"\",B396+1)","v":""}]
[null,""]
[null,""]
[null,""]
[null,""]
[null,""]
[null,""]
[null,""]
[null,""]
[null,""]
[null,""]
[null,""]
[null,""]
[null,""]
[null,""]
[null,""]
[null,""]
[null,""]
[null,""]
[null,""]
[null,""]
[null,""]
[null,""]
[null,""]
[null,""]
[null,""]
[null,""]
[null,""]
[null,""]
[null,""]
[null,""]
[null,""]
[null,""]
[null,""]
[null,""]
[null,""]
[null,""]
[null,""]
[null,""]
[null,""]
[null,""]
[null,""]
[null,""]
[null,""]
[null,""]
[null,""]
[null,""]
[null,""]
[null,""]
[null,""]
[null,""]
[null,""]
[null,""]
[null,""]
[null,""]
[null,""]
[null,""]
[null,""]
[null,""]
[null,""]
[null,""]
[null,""]
[null,""]
[null,""]
[null,{"$f":"IF(C461=\"\",\"\",B460+1)","v":""}]
[null,""]
[null,""]
[null,""]
[null,""]
[null,""]
[null,""]
[null,""]
[null,""]
[null,""]
[null,""]
[null,""]
[null,""]
[null,""]
[null,""]
[null,""]
[null,""]
[null,""]
[null,""]
[null,""]
[null,""]
[null,""]
[null,""]
[null,""]
[null,""]
[null,""]
[null,""]
[null,""]
[null,""]
[null,""]
[null,""]
[null,""]
[null,""]
[null,""]
[null,""]
[null,""]
[null,""]
[null,""]
[null,""]
[null,""]
[null,""]
[null,""]
[null,""]
[null,""]
[null,""]
[null,""]
[null,""]
[null,""]
[null,""]
[null,""]
[]
[null,null,null,null,null,null,null,null,null,null,null,null,null,null,null,null,null,null,null,null,null,null,null,null,null,null,null,null,null,null,null,null,null,null,"Totais pagas",{"$f":"SUM(AJ11:AJ510)","v":0},{"$f":"SUM(AK11:AK510)","v":0},0,0,0,{"$f":"SUM(AO11:AO510)","v":0}]

{"sheet":"Guia 11","index":10,"n_rows":512,"n_cols":46,"rows_kept":512,"cut":false,"hidden":true,"merged":[[4,2,4,8],[5,4,5,7],[6,2,6,5],[6,6,6,9],[6,10,6,11],[7,19,8,19],[6,15,6,22],[6,23,6,34],[6,35,6,45],[7,2,8,2],[7,3,8,3],[7,4,8,4],[7,5,8,5],[7,6,8,6],[7,7,8,7],[7,8,8,8],[6,14,8,14],[7,9,8,9],[7,10,8,10],[7,11,8,11],[7,12,8,12],[7,13,8,13],[7,15,8,15],[7,16,8,16],[7,17,8,17],[7,18,8,18],[7,35,7,40],[7,41,7,43],[7,44,7,45],[7,20,8,20],[7,21,8,21],[7,22,8,22],[7,23,7,28],[7,29,7,31],[7,32,7,34]]}
[]
[null,null,"Superior Tribunal de Justiça"]
[null,null,"Secretaria de Processamento de Feitos"]
[null,null,"Coordenadoria de Processamento de Feitos em Execução Judicial"]
[null,null,{"$f":"\"Relação das Requisições de Pequeno Valor - RPV pagas pelo STJ em \"&IF(F11=\"\",\"\",UPPER((TEXT(F11,\"mmmm/aaaa\"))))","v":"Relação das Requisições de Pequeno Valor - RPV pagas pelo STJ em "}]
[]
[null,null,"RPV",null,null,null,"P R O C E S S O     D E     O R I G E M",null,null,null,"E N T I D A D E S",null,"R E Q U E R E N T E","A D V O G A D O","Natureza do crédito","I N D I C A D O R E S",null,null,null,null,null,null,null,"VALORES REQUISITADOS",null,null,null,null,null,null,null,null,null,null,null,"VALORES ATUALIZADOS PARA PAGAMENTO"]
[null,null,"Nº","Registro","Autuada em","data do pgto","Ação","Autuada em","Tipo de causa","Trânsito","Entidade devedora","Órgão de origem","Origem do crédito","Origem do crédito",null,"Tributário","EC 94 2016","Lei 13.463 2017","PRC/RPV de origem","Nº DA GRU","DOENÇA GRAVE","Deficiência física","Isento de IR","Beneficiários",null,null,null,null,null,"PSSS",null,null,"R R A",null,null,"Beneficiários",null,null,null,null,null,"P S S S",null,null,"R R A"]
[null,null,null,null,null,null,null,null,null,null,null,null,null,null,null,null,null,null,null,null,null,null,null,"Total","Adv I","Adv II","Adv III","Adv IV","Requerente","Base","Desc","Patronal","NMA","Exercícios anteriores","Desconto","Total","Adv I","Adv II","Adv III","Adv IV","Reqte","BASE desc","Desc","Patronal","Exercícios anteriores","Dedução"]
[]
[null,{"$f":"IF(C11=\"\",\"\",1)","v":""}]
[null,{"$f":"IF(C12=\"\",\"\",B11+1)","v":""}]
[null,{"$f":"IF(C13=\"\",\"\",B12+1)","v":""}]
[null,""]
[null,""]
[null,""]
[null,""]
[null,""]
[null,""]
[null,""]
[null,""]
[null,""]
[null,""]
[null,""]
[null,""]
[null,""]
[null,""]
[null,""]
[null,""]
[null,""]
[null,""]
[null,""]
[null,""]
[null,""]
[null,""]
[null,""]
[null,""]
[null,""]
[null,""]
[null,""]
[null,""]
[null,""]
[null,""]
[null,""]
[null,""]
[null,""]
[null,""]
[null,""]
[null,""]
[null,""]
[null,""]
[null,""]
[null,""]
[null,""]
[null,""]
[null,""]
[null,""]
[null,""]
[null,""]
[null,""]
[null,""]
[null,""]
[null,""]
[null,""]
[null,""]
[null,""]
[null,""]
[null,""]
[null,""]
[null,""]
[null,""]
[null,""]
[null,""]
[null,""]
[null,""]
[null,""]
[null,{"$f":"IF(C77=\"\",\"\",B76+1)","v":""}]
[null,""]
[null,""]
[null,""]
[null,""]
[null,""]
[null,""]
[null,""]
[null,""]
[null,""]
[null,""]
[null,""]
[null,""]
[null,""]
[null,""]
[null,""]
[null,""]
[null,""]
[null,""]
[null,""]
[null,""]
[null,""]
[null,""]
[null,""]
[null,""]
[null,""]
[null,""]
[null,""]
[null,""]
[null,""]
[null,""]
[null,""]
[null,""]
[null,""]
[null,""]
[null,""]
[null,""]
[null,""]
[null,""]
[null,""]
[null,""]
[null,""]
[null,""]
[null,""]
[null,""]
[null,""]
[null,""]
[null,""]
[null,""]
[null,""]
[null,""]
[null,""]
[null,""]
[null,""]
[null,""]
[null,""]
[null,""]
[null,""]
[null,""]
[null,""]
[null,""]
[null,""]
[null,""]
[null,""]
[null,{"$f":"IF(C141=\"\",\"\",B140+1)","v":""}]
[null,""]
[null,""]
[null,""]
[null,""]
[null,""]
[null,""]
[null,""]
[null,""]
[null,""]
[null,""]
[null,""]
[null,""]
[null,""]
[null,""]
[null,""]
[null,""]
[null,""]
[null,""]
[null,""]
[null,""]
[null,""]
[null,""]
[null,""]
[null,""]
[null,""]
[null,""]
[null,""]
[null,""]
[null,""]
[null,""]
[null,""]
[null,""]
[null,""]
[null,""]
[null,""]
[null,""]
[null,""]
[null,""]
[null,""]
[null,""]
[null,""]
[null,""]
[null,""]
[null,""]
[null,""]
[null,""]
[null,""]
[null,""]
[null,""]
[null,""]
[null,""]
[null,""]
[null,""]
[null,""]
[null,""]
[null,""]
[null,""]
[null,""]
[null,""]
[null,""]
[null,""]
[null,""]
[null,""]
[null,{"$f":"IF(C205=\"\",\"\",B204+1)","v":""}]
[null,""]
[null,""]
[null,""]
[null,""]
[null,""]
[null,""]
[null,""]
[null,""]
[null,""]
[null,""]
[null,""]
[null,""]
[null,""]
[null,""]
[null,""]
[null,""]
[null,""]
[null,""]
[null,""]
[null,""]
[null,""]
[null,""]
[null,""]
[null,""]
[null,""]
[null,""]
[null,""]
[null,""]
[null,""]
[null,""]
[null,""]
[null,""]
[null,""]
[null,""]
[null,""]
[null,""]
[null,""]
[null,""]
[null,""]
[null,""]
[null,""]
[null,""]
[null,""]
[null,""]
[null,""]
[null,""]
[null,""]
[null,""]
[null,""]
[null,""]
[null,""]
[null,""]
[null,""]
[null,""]
[null,""]
[null,""]
[null,""]
[null,""]
[null,""]
[null,""]
[null,""]
[null,""]
[null,""]
[null,{"$f":"IF(C269=\"\",\"\",B268+1)","v":""}]
[null,""]
[null,""]
[null,""]
[null,""]
[null,""]
[null,""]
[null,""]
[null,""]
[null,""]
[null,""]
[null,""]
[null,""]
[null,""]
[null,""]
[null,""]
[null,""]
[null,""]
[null,""]
[null,""]
[null,""]
[null,""]
[null,""]
[null,""]
[null,""]
[null,""]
[null,""]
[null,""]
[null,""]
[null,""]
[null,""]
[null,""]
[null,""]
[null,""]
[null,""]
[null,""]
[null,""]
[null,""]
[null,""]
[null,""]
[null,""]
[null,""]
[null,""]
[null,""]
[null,""]
[null,""]
[null,""]
[null,""]
[null,""]
[null,""]
[null,""]
[null,""]
[null,""]
[null,""]
[null,""]
[null,""]
[null,""]
[null,""]
[null,""]
[null,""]
[null,""]
[null,""]
[null,""]
[null,""]
[null,{"$f":"IF(C333=\"\",\"\",B332+1)","v":""}]
[null,""]
[null,""]
[null,""]
[null,""]
[null,""]
[null,""]
[null,""]
[null,""]
[null,""]
[null,""]
[null,""]
[null,""]
[null,""]
[null,""]
[null,""]
[null,""]
[null,""]
[null,""]
[null,""]
[null,""]
[null,""]
[null,""]
[null,""]
[null,""]
[null,""]
[null,""]
[null,""]
[null,""]
[null,""]
[null,""]
[null,""]
[null,""]
[null,""]
[null,""]
[null,""]
[null,""]
[null,""]
[null,""]
[null,""]
[null,""]
[null,""]
[null,""]
[null,""]
[null,""]
[null,""]
[null,""]
[null,""]
[null,""]
[null,""]
[null,""]
[null,""]
[null,""]
[null,""]
[null,""]
[null,""]
[null,""]
[null,""]
[null,""]
[null,""]
[null,""]
[null,""]
[null,""]
[null,""]
[null,{"$f":"IF(C397=\"\",\"\",B396+1)","v":""}]
[null,""]
[null,""]
[null,""]
[null,""]
[null,""]
[null,""]
[null,""]
[null,""]
[null,""]
[null,""]
[null,""]
[null,""]
[null,""]
[null,""]
[null,""]
[null,""]
[null,""]
[null,""]
[null,""]
[null,""]
[null,""]
[null,""]
[null,""]
[null,""]
[null,""]
[null,""]
[null,""]
[null,""]
[null,""]
[null,""]
[null,""]
[null,""]
[null,""]
[null,""]
[null,""]
[null,""]
[null,""]
[null,""]
[null,""]
[null,""]
[null,""]
[null,""]
[null,""]
[null,""]
[null,""]
[null,""]
[null,""]
[null,""]
[null,""]
[null,""]
[null,""]
[null,""]
[null,""]
[null,""]
[null,""]
[null,""]
[null,""]
[null,""]
[null,""]
[null,""]
[null,""]
[null,""]
[null,""]
[null,{"$f":"IF(C461=\"\",\"\",B460+1)","v":""}]
[null,""]
[null,""]
[null,""]
[null,""]
[null,""]
[null,""]
[null,""]
[null,""]
[null,""]
[null,""]
[null,""]
[null,""]
[null,""]
[null,""]
[null,""]
[null,""]
[null,""]
[null,""]
[null,""]
[null,""]
[null,""]
[null,""]
[null,""]
[null,""]
[null,""]
[null,""]
[null,""]
[null,""]
[null,""]
[null,""]
[null,""]
[null,""]
[null,""]
[null,""]
[null,""]
[null,""]
[null,""]
[null,""]
[null,""]
[null,""]
[null,""]
[null,""]
[null,""]
[null,""]
[null,""]
[null,""]
[null,""]
[null,""]
[null,""]
[]
[null,null,null,null,null,null,null,null,null,null,null,null,null,null,null,null,null,null,null,null,null,null,null,null,null,null,null,null,null,null,null,null,null,null,"Totais pagas",{"$f":"SUM(AJ11:AJ510)","v":0},{"$f":"SUM(AK11:AK510)","v":0},0,0,0,{"$f":"SUM(AO11:AO510)","v":0}]

{"sheet":"Guia 12","index":11,"n_rows":512,"n_cols":46,"rows_kept":512,"cut":false,"hidden":true,"merged":[[4,2,4,8],[5,4,5,7],[6,2,6,5],[6,6,6,9],[6,10,6,11],[7,19,8,19],[6,15,6,22],[6,23,6,34],[6,35,6,45],[7,2,8,2],[7,3,8,3],[7,4,8,4],[7,5,8,5],[7,6,8,6],[7,7,8,7],[7,8,8,8],[6,14,8,14],[7,9,8,9],[7,10,8,10],[7,11,8,11],[7,12,8,12],[7,13,8,13],[7,15,8,15],[7,16,8,16],[7,17,8,17],[7,18,8,18],[7,35,7,40],[7,41,7,43],[7,44,7,45],[7,20,8,20],[7,21,8,21],[7,22,8,22],[7,23,7,28],[7,29,7,31],[7,32,7,34]]}
[]
[null,null,"Superior Tribunal de Justiça"]
[null,null,"Secretaria de Processamento de Feitos"]
[null,null,"Coordenadoria de Processamento de Feitos em Execução Judicial"]
[null,null,{"$f":"\"Relação das Requisições de Pequeno Valor - RPV pagas pelo STJ em \"&IF(F11=\"\",\"\",UPPER((TEXT(F11,\"mmmm/aaaa\"))))","v":"Relação das Requisições de Pequeno Valor - RPV pagas pelo STJ em "}]
[]
[null,null,"RPV",null,null,null,"P R O C E S S O     D E     O R I G E M",null,null,null,"E N T I D A D E S",null,"R E Q U E R E N T E","A D V O G A D O","Natureza do crédito","I N D I C A D O R E S",null,null,null,null,null,null,null,"VALORES REQUISITADOS",null,null,null,null,null,null,null,null,null,null,null,"VALORES ATUALIZADOS PARA PAGAMENTO"]
[null,null,"Nº","Registro","Autuada em","data do pgto","Ação","Autuada em","Tipo de causa","Trânsito","Entidade devedora","Órgão de origem","Origem do crédito","Origem do crédito",null,"Tributário","EC 94 2016","Lei 13.463 2017","PRC/RPV de origem","Nº DA GRU","DOENÇA GRAVE","Deficiência física","Isento de IR","Beneficiários",null,null,null,null,null,"PSSS",null,null,"R R A",null,null,"Beneficiários",null,null,null,null,null,"P S S S",null,null,"R R A"]
[null,null,null,null,null,null,null,null,null,null,null,null,null,null,null,null,null,null,null,null,null,null,null,"Total","Adv I","Adv II","Adv III","Adv IV","Requerente","Base","Desc","Patronal","NMA","Exercícios anteriores","Desconto","Total","Adv I","Adv II","Adv III","Adv IV","Reqte","BASE desc","Desc","Patronal","Exercícios anteriores","Dedução"]
[]
[null,{"$f":"IF(C11=\"\",\"\",1)","v":""}]
[null,{"$f":"IF(C12=\"\",\"\",B11+1)","v":""}]
[null,{"$f":"IF(C13=\"\",\"\",B12+1)","v":""}]
[null,""]
[null,""]
[null,""]
[null,""]
[null,""]
[null,""]
[null,""]
[null,""]
[null,""]
[null,""]
[null,""]
[null,""]
[null,""]
[null,""]
[null,""]
[null,""]
[null,""]
[null,""]
[null,""]
[null,""]
[null,""]
[null,""]
[null,""]
[null,""]
[null,""]
[null,""]
[null,""]
[null,""]
[null,""]
[null,""]
[null,""]
[null,""]
[null,""]
[null,""]
[null,""]
[null,""]
[null,""]
[null,""]
[null,""]
[null,""]
[null,""]
[null,""]
[null,""]
[null,""]
[null,""]
[null,""]
[null,""]
[null,""]
[null,""]
[null,""]
[null,""]
[null,""]
[null,""]
[null,""]
[null,""]
[null,""]
[null,""]
[null,""]
[null,""]
[null,""]
[null,""]
[null,""]
[null,""]
[null,{"$f":"IF(C77=\"\",\"\",B76+1)","v":""}]
[null,""]
[null,""]
[null,""]
[null,""]
[null,""]
[null,""]
[null,""]
[null,""]
[null,""]
[null,""]
[null,""]
[null,""]
[null,""]
[null,""]
[null,""]
[null,""]
[null,""]
[null,""]
[null,""]
[null,""]
[null,""]
[null,""]
[null,""]
[null,""]
[null,""]
[null,""]
[null,""]
[null,""]
[null,""]
[null,""]
[null,""]
[null,""]
[null,""]
[null,""]
[null,""]
[null,""]
[null,""]
[null,""]
[null,""]
[null,""]
[null,""]
[null,""]
[null,""]
[null,""]
[null,""]
[null,""]
[null,""]
[null,""]
[null,""]
[null,""]
[null,""]
[null,""]
[null,""]
[null,""]
[null,""]
[null,""]
[null,""]
[null,""]
[null,""]
[null,""]
[null,""]
[null,""]
[null,""]
[null,{"$f":"IF(C141=\"\",\"\",B140+1)","v":""}]
[null,""]
[null,""]
[null,""]
[null,""]
[null,""]
[null,""]
[null,""]
[null,""]
[null,""]
[null,""]
[null,""]
[null,""]
[null,""]
[null,""]
[null,""]
[null,""]
[null,""]
[null,""]
[null,""]
[null,""]
[null,""]
[null,""]
[null,""]
[null,""]
[null,""]
[null,""]
[null,""]
[null,""]
[null,""]
[null,""]
[null,""]
[null,""]
[null,""]
[null,""]
[null,""]
[null,""]
[null,""]
[null,""]
[null,""]
[null,""]
[null,""]
[null,""]
[null,""]
[null,""]
[null,""]
[null,""]
[null,""]
[null,""]
[null,""]
[null,""]
[null,""]
[null,""]
[null,""]
[null,""]
[null,""]
[null,""]
[null,""]
[null,""]
[null,""]
[null,""]
[null,""]
[null,""]
[null,""]
[null,{"$f":"IF(C205=\"\",\"\",B204+1)","v":""}]
[null,""]
[null,""]
[null,""]
[null,""]
[null,""]
[null,""]
[null,""]
[null,""]
[null,""]
[null,""]
[null,""]
[null,""]
[null,""]
[null,""]
[null,""]
[null,""]
[null,""]
[null,""]
[null,""]
[null,""]
[null,""]
[null,""]
[null,""]
[null,""]
[null,""]
[null,""]
[null,""]
[null,""]
[null,""]
[null,""]
[null,""]
[null,""]
[null,""]
[null,""]
[null,""]
[null,""]
[null,""]
[null,""]
[null,""]
[null,""]
[null,""]
[null,""]
[null,""]
[null,""]
[null,""]
[null,""]
[null,""]
[null,""]
[null,""]
[null,""]
[null,""]
[null,""]
[null,""]
[null,""]
[null,""]
[null,""]
[null,""]
[null,""]
[null,""]
[null,""]
[null,""]
[null,""]
[null,""]
[null,{"$f":"IF(C269=\"\",\"\",B268+1)","v":""}]
[null,""]
[null,""]
[null,""]
[null,""]
[null,""]
[null,""]
[null,""]
[null,""]
[null,""]
[null,""]
[null,""]
[null,""]
[null,""]
[null,""]
[null,""]
[null,""]
[null,""]
[null,""]
[null,""]
[null,""]
[null,""]
[null,""]
[null,""]
[null,""]
[null,""]
[null,""]
[null,""]
[null,""]
[null,""]
[null,""]
[null,""]
[null,""]
[null,""]
[null,""]
[null,""]
[null,""]
[null,""]
[null,""]
[null,""]
[null,""]
[null,""]
[null,""]
[null,""]
[null,""]
[null,""]
[null,""]
[null,""]
[null,""]
[null,""]
[null,""]
[null,""]
[null,""]
[null,""]
[null,""]
[null,""]
[null,""]
[null,""]
[null,""]
[null,""]
[null,""]
[null,""]
[null,""]
[null,""]
[null,{"$f":"IF(C333=\"\",\"\",B332+1)","v":""}]
[null,""]
[null,""]
[null,""]
[null,""]
[null,""]
[null,""]
[null,""]
[null,""]
[null,""]
[null,""]
[null,""]
[null,""]
[null,""]
[null,""]
[null,""]
[null,""]
[null,""]
[null,""]
[null,""]
[null,""]
[null,""]
[null,""]
[null,""]
[null,""]
[null,""]
[null,""]
[null,""]
[null,""]
[null,""]
[null,""]
[null,""]
[null,""]
[null,""]
[null,""]
[null,""]
[null,""]
[null,""]
[null,""]
[null,""]
[null,""]
[null,""]
[null,""]
[null,""]
[null,""]
[null,""]
[null,""]
[null,""]
[null,""]
[null,""]
[null,""]
[null,""]
[null,""]
[null,""]
[null,""]
[null,""]
[null,""]
[null,""]
[null,""]
[null,""]
[null,""]
[null,""]
[null,""]
[null,""]
[null,{"$f":"IF(C397=\"\",\"\",B396+1)","v":""}]
[null,""]
[null,""]
[null,""]
[null,""]
[null,""]
[null,""]
[null,""]
[null,""]
[null,""]
[null,""]
[null,""]
[null,""]
[null,""]
[null,""]
[null,""]
[null,""]
[null,""]
[null,""]
[null,""]
[null,""]
[null,""]
[null,""]
[null,""]
[null,""]
[null,""]
[null,""]
[null,""]
[null,""]
[null,""]
[null,""]
[null,""]
[null,""]
[null,""]
[null,""]
[null,""]
[null,""]
[null,""]
[null,""]
[null,""]
[null,""]
[null,""]
[null,""]
[null,""]
[null,""]
[null,""]
[null,""]
[null,""]
[null,""]
[null,""]
[null,""]
[null,""]
[null,""]
[null,""]
[null,""]
[null,""]
[null,""]
[null,""]
[null,""]
[null,""]
[null,""]
[null,""]
[null,""]
[null,""]
[null,{"$f":"IF(C461=\"\",\"\",B460+1)","v":""}]
[null,""]
[null,""]
[null,""]
[null,""]
[null,""]
[null,""]
[null,""]
[null,""]
[null,""]
[null,""]
[null,""]
[null,""]
[null,""]
[null,""]
[null,""]
[null,""]
[null,""]
[null,""]
[null,""]
[null,""]
[null,""]
[null,""]
[null,""]
[null,""]
[null,""]
[null,""]
[null,""]
[null,""]
[null,""]
[null,""]
[null,""]
[null,""]
[null,""]
[null,""]
[null,""]
[null,""]
[null,""]
[null,""]
[null,""]
[null,""]
[null,""]
[null,""]
[null,""]
[null,""]
[null,""]
[null,""]
[null,""]
[null,""]
[null,""]
[]
[null,null,null,null,null,null,null,null,null,null,null,null,null,null,null,null,null,null,null,null,null,null,null,null,null,null,null,null,null,null,null,null,null,null,"Totais pagas",{"$f":"SUM(AJ11:AJ510)","v":0},{"$f":"SUM(AK11:AK510)","v":0},0,0,0,{"$f":"SUM(AO11:AO510)","v":0}]

{"sheet":"Guia 13","index":12,"n_rows":512,"n_cols":46,"rows_kept":512,"cut":false,"hidden":true,"merged":[[4,2,4,8],[5,4,5,7],[6,2,6,5],[6,6,6,9],[6,10,6,11],[7,19,8,19],[6,15,6,22],[6,23,6,34],[6,35,6,45],[7,2,8,2],[7,3,8,3],[7,4,8,4],[7,5,8,5],[7,6,8,6],[7,7,8,7],[7,8,8,8],[6,14,8,14],[7,9,8,9],[7,10,8,10],[7,11,8,11],[7,12,8,12],[7,13,8,13],[7,15,8,15],[7,16,8,16],[7,17,8,17],[7,18,8,18],[7,35,7,40],[7,41,7,43],[7,44,7,45],[7,20,8,20],[7,21,8,21],[7,22,8,22],[7,23,7,28],[7,29,7,31],[7,32,7,34]]}
[]
[null,null,"Superior Tribunal de Justiça"]
[null,null,"Secretaria de Processamento de Feitos"]
[null,null,"Coordenadoria de Processamento de Feitos em Execução Judicial"]
[null,null,{"$f":"\"Relação das Requisições de Pequeno Valor - RPV pagas pelo STJ em \"&IF(F11=\"\",\"\",UPPER((TEXT(F11,\"mmmm/aaaa\"))))","v":"Relação das Requisições de Pequeno Valor - RPV pagas pelo STJ em "}]
[]
[null,null,"RPV",null,null,null,"P R O C E S S O     D E     O R I G E M",null,null,null,"E N T I D A D E S",null,"R E Q U E R E N T E","A D V O G A D O","Natureza do crédito","I N D I C A D O R E S",null,null,null,null,null,null,null,"VALORES REQUISITADOS",null,null,null,null,null,null,null,null,null,null,null,"VALORES ATUALIZADOS PARA PAGAMENTO"]
[null,null,"Nº","Registro","Autuada em","data do pgto","Ação","Autuada em","Tipo de causa","Trânsito","Entidade devedora","Órgão de origem","Origem do crédito","Origem do crédito",null,"Tributário","EC 94 2016","Lei 13.463 2017","PRC/RPV de origem","Nº DA GRU","DOENÇA GRAVE","Deficiência física","Isento de IR","Beneficiários",null,null,null,null,null,"PSSS",null,null,"R R A",null,null,"Beneficiários",null,null,null,null,null,"P S S S",null,null,"R R A"]
[null,null,null,null,null,null,null,null,null,null,null,null,null,null,null,null,null,null,null,null,null,null,null,"Total","Adv I","Adv II","Adv III","Adv IV","Requerente","Base","Desc","Patronal","NMA","Exercícios anteriores","Desconto","Total","Adv I","Adv II","Adv III","Adv IV","Reqte","BASE desc","Desc","Patronal","Exercícios anteriores","Dedução"]
[]
[null,{"$f":"IF(C11=\"\",\"\",1)","v":""}]
[null,{"$f":"IF(C12=\"\",\"\",B11+1)","v":""}]
[null,{"$f":"IF(C13=\"\",\"\",B12+1)","v":""}]
[null,""]
[null,""]
[null,""]
[null,""]
[null,""]
[null,""]
[null,""]
[null,""]
[null,""]
[null,""]
[null,""]
[null,""]
[null,""]
[null,""]
[null,""]
[null,""]
[null,""]
[null,""]
[null,""]
[null,""]
[null,""]
[null,""]
[null,""]
[null,""]
[null,""]
[null,""]
[null,""]
[null,""]
[null,""]
[null,""]
[null,""]
[null,""]
[null,""]
[null,""]
[null,""]
[null,""]
[null,""]
[null,""]
[null,""]
[null,""]
[null,""]
[null,""]
[null,""]
[null,""]
[null,""]
[null,""]
[null,""]
[null,""]
[null,""]
[null,""]
[null,""]
[null,""]
[null,""]
[null,""]
[null,""]
[null,""]
[null,""]
[null,""]
[null,""]
[null,""]
[null,""]
[null,""]
[null,""]
[null,{"$f":"IF(C77=\"\",\"\",B76+1)","v":""}]
[null,""]
[null,""]
[null,""]
[null,""]
[null,""]
[null,""]
[null,""]
[null,""]
[null,""]
[null,""]
[null,""]
[null,""]
[null,""]
[null,""]
[null,""]
[null,""]
[null,""]
[null,""]
[null,""]
[null,""]
[null,""]
[null,""]
[null,""]
[null,""]
[null,""]
[null,""]
[null,""]
[null,""]
[null,""]
[null,""]
[null,""]
[null,""]
[null,""]
[null,""]
[null,""]
[null,""]
[null,""]
[null,""]
[null,""]
[null,""]
[null,""]
[null,""]
[null,""]
[null,""]
[null,""]
[null,""]
[null,""]
[null,""]
[null,""]
[null,""]
[null,""]
[null,""]
[null,""]
[null,""]
[null,""]
[null,""]
[null,""]
[null,""]
[null,""]
[null,""]
[null,""]
[null,""]
[null,""]
[null,{"$f":"IF(C141=\"\",\"\",B140+1)","v":""}]
[null,""]
[null,""]
[null,""]
[null,""]
[null,""]
[null,""]
[null,""]
[null,""]
[null,""]
[null,""]
[null,""]
[null,""]
[null,""]
[null,""]
[null,""]
[null,""]
[null,""]
[null,""]
[null,""]
[null,""]
[null,""]
[null,""]
[null,""]
[null,""]
[null,""]
[null,""]
[null,""]
[null,""]
[null,""]
[null,""]
[null,""]
[null,""]
[null,""]
[null,""]
[null,""]
[null,""]
[null,""]
[null,""]
[null,""]
[null,""]
[null,""]
[null,""]
[null,""]
[null,""]
[null,""]
[null,""]
[null,""]
[null,""]
[null,""]
[null,""]
[null,""]
[null,""]
[null,""]
[null,""]
[null,""]
[null,""]
[null,""]
[null,""]
[null,""]
[null,""]
[null,""]
[null,""]
[null,""]
[null,{"$f":"IF(C205=\"\",\"\",B204+1)","v":""}]
[null,""]
[null,""]
[null,""]
[null,""]
[null,""]
[null,""]
[null,""]
[null,""]
[null,""]
[null,""]
[null,""]
[null,""]
[null,""]
[null,""]
[null,""]
[null,""]
[null,""]
[null,""]
[null,""]
[null,""]
[null,""]
[null,""]
[null,""]
[null,""]
[null,""]
[null,""]
[null,""]
[null,""]
[null,""]
[null,""]
[null,""]
[null,""]
[null,""]
[null,""]
[null,""]
[null,""]
[null,""]
[null,""]
[null,""]
[null,""]
[null,""]
[null,""]
[null,""]
[null,""]
[null,""]
[null,""]
[null,""]
[null,""]
[null,""]
[null,""]
[null,""]
[null,""]
[null,""]
[null,""]
[null,""]
[null,""]
[null,""]
[null,""]
[null,""]
[null,""]
[null,""]
[null,""]
[null,""]
[null,{"$f":"IF(C269=\"\",\"\",B268+1)","v":""}]
[null,""]
[null,""]
[null,""]
[null,""]
[null,""]
[null,""]
[null,""]
[null,""]
[null,""]
[null,""]
[null,""]
[null,""]
[null,""]
[null,""]
[null,""]
[null,""]
[null,""]
[null,""]
[null,""]
[null,""]
[null,""]
[null,""]
[null,""]
[null,""]
[null,""]
[null,""]
[null,""]
[null,""]
[null,""]
[null,""]
[null,""]
[null,""]
[null,""]
[null,""]
[null,""]
[null,""]
[null,""]
[null,""]
[null,""]
[null,""]
[null,""]
[null,""]
[null,""]
[null,""]
[null,""]
[null,""]
[null,""]
[null,""]
[null,""]
[null,""]
[null,""]
[null,""]
[null,""]
[null,""]
[null,""]
[null,""]
[null,""]
[null,""]
[null,""]
[null,""]
[null,""]
[null,""]
[null,""]
[null,{"$f":"IF(C333=\"\",\"\",B332+1)","v":""}]
[null,""]
[null,""]
[null,""]
[null,""]
[null,""]
[null,""]
[null,""]
[null,""]
[null,""]
[null,""]
[null,""]
[null,""]
[null,""]
[null,""]
[null,""]
[null,""]
[null,""]
[null,""]
[null,""]
[null,""]
[null,""]
[null,""]
[null,""]
[null,""]
[null,""]
[null,""]
[null,""]
[null,""]
[null,""]
[null,""]
[null,""]
[null,""]
[null,""]
[null,""]
[null,""]
[null,""]
[null,""]
[null,""]
[null,""]
[null,""]
[null,""]
[null,""]
[null,""]
[null,""]
[null,""]
[null,""]
[null,""]
[null,""]
[null,""]
[null,""]
[null,""]
[null,""]
[null,""]
[null,""]
[null,""]
[null,""]
[null,""]
[null,""]
[null,""]
[null,""]
[null,""]
[null,""]
[null,""]
[null,{"$f":"IF(C397=\"\",\"\",B396+1)","v":""}]
[null,""]
[null,""]
[null,""]
[null,""]
[null,""]
[null,""]
[null,""]
[null,""]
[null,""]
[null,""]
[null,""]
[null,""]
[null,""]
[null,""]
[null,""]
[null,""]
[null,""]
[null,""]
[null,""]
[null,""]
[null,""]
[null,""]
[null,""]
[null,""]
[null,""]
[null,""]
[null,""]
[null,""]
[null,""]
[null,""]
[null,""]
[null,""]
[null,""]
[null,""]
[null,""]
[null,""]
[null,""]
[null,""]
[null,""]
[null,""]
[null,""]
[null,""]
[null,""]
[null,""]
[null,""]
[null,""]
[null,""]
[null,""]
[null,""]
[null,""]
[null,""]
[null,""]
[null,""]
[null,""]
[null,""]
[null,""]
[null,""]
[null,""]
[null,""]
[null,""]
[null,""]
[null,""]
[null,""]
[null,{"$f":"IF(C461=\"\",\"\",B460+1)","v":""}]
[null,""]
[null,""]
[null,""]
[null,""]
[null,""]
[null,""]
[null,""]
[null,""]
[null,""]
[null,""]
[null,""]
[null,""]
[null,""]
[null,""]
[null,""]
[null,""]
[null,""]
[null,""]
[null,""]
[null,""]
[null,""]
[null,""]
[null,""]
[null,""]
[null,""]
[null,""]
[null,""]
[null,""]
[null,""]
[null,""]
[null,""]
[null,""]
[null,""]
[null,""]
[null,""]
[null,""]
[null,""]
[null,""]
[null,""]
[null,""]
[null,""]
[null,""]
[null,""]
[null,""]
[null,""]
[null,""]
[null,""]
[null,""]
[null,""]
[]
[null,null,null,null,null,null,null,null,null,null,null,null,null,null,null,null,null,null,null,null,null,null,null,null,null,null,null,null,null,null,null,null,null,null,"Totais pagas",{"$f":"SUM(AJ11:AJ510)","v":0},{"$f":"SUM(AK11:AK510)","v":0},0,0,0,{"$f":"SUM(AO11:AO510)","v":0}]

{"sheet":"Guia 14","index":13,"n_rows":512,"n_cols":46,"rows_kept":512,"cut":false,"hidden":true,"merged":[[4,2,4,8],[5,4,5,7],[6,2,6,5],[6,6,6,9],[6,10,6,11],[7,19,8,19],[6,15,6,22],[6,23,6,34],[6,35,6,45],[7,2,8,2],[7,3,8,3],[7,4,8,4],[7,5,8,5],[7,6,8,6],[7,7,8,7],[7,8,8,8],[6,14,8,14],[7,9,8,9],[7,10,8,10],[7,11,8,11],[7,12,8,12],[7,13,8,13],[7,15,8,15],[7,16,8,16],[7,17,8,17],[7,18,8,18],[7,35,7,40],[7,41,7,43],[7,44,7,45],[7,20,8,20],[7,21,8,21],[7,22,8,22],[7,23,7,28],[7,29,7,31],[7,32,7,34]]}
[]
[null,null,"Superior Tribunal de Justiça"]
[null,null,"Secretaria de Processamento de Feitos"]
[null,null,"Coordenadoria de Processamento de Feitos em Execução Judicial"]
[null,null,{"$f":"\"Relação das Requisições de Pequeno Valor - RPV pagas pelo STJ em \"&IF(F11=\"\",\"\",UPPER((TEXT(F11,\"mmmm/aaaa\"))))","v":"Relação das Requisições de Pequeno Valor - RPV pagas pelo STJ em "}]
[]
[null,null,"RPV",null,null,null,"P R O C E S S O     D E     O R I G E M",null,null,null,"E N T I D A D E S",null,"R E Q U E R E N T E","A D V O G A D O","Natureza do crédito","I N D I C A D O R E S",null,null,null,null,null,null,null,"VALORES REQUISITADOS",null,null,null,null,null,null,null,null,null,null,null,"VALORES ATUALIZADOS PARA PAGAMENTO"]
[null,null,"Nº","Registro","Autuada em","data do pgto","Ação","Autuada em","Tipo de causa","Trânsito","Entidade devedora","Órgão de origem","Origem do crédito","Origem do crédito",null,"Tributário","EC 94 2016","Lei 13.463 2017","PRC/RPV de origem","Nº DA GRU","DOENÇA GRAVE","Deficiência física","Isento de IR","Beneficiários",null,null,null,null,null,"PSSS",null,null,"R R A",null,null,"Beneficiários",null,null,null,null,null,"P S S S",null,null,"R R A"]
[null,null,null,null,null,null,null,null,null,null,null,null,null,null,null,null,null,null,null,null,null,null,null,"Total","Adv I","Adv II","Adv III","Adv IV","Requerente","Base","Desc","Patronal","NMA","Exercícios anteriores","Desconto","Total","Adv I","Adv II","Adv III","Adv IV","Reqte","BASE desc","Desc","Patronal","Exercícios anteriores","Dedução"]
[]
[null,{"$f":"IF(C11=\"\",\"\",1)","v":""}]
[null,{"$f":"IF(C12=\"\",\"\",B11+1)","v":""}]
[null,{"$f":"IF(C13=\"\",\"\",B12+1)","v":""}]
[null,""]
[null,""]
[null,""]
[null,""]
[null,""]
[null,""]
[null,""]
[null,""]
[null,""]
[null,""]
[null,""]
[null,""]
[null,""]
[null,""]
[null,""]
[null,""]
[null,""]
[null,""]
[null,""]
[null,""]
[null,""]
[null,""]
[null,""]
[null,""]
[null,""]
[null,""]
[null,""]
[null,""]
[null,""]
[null,""]
[null,""]
[null,""]
[null,""]
[null,""]
[null,""]
[null,""]
[null,""]
[null,""]
[null,""]
[null,""]
[null,""]
[null,""]
[null,""]
[null,""]
[null,""]
[null,""]
[null,""]
[null,""]
[null,""]
[null,""]
[null,""]
[null,""]
[null,""]
[null,""]
[null,""]
[null,""]
[null,""]
[null,""]
[null,""]
[null,""]
[null,""]
[null,""]
[null,""]
[null,{"$f":"IF(C77=\"\",\"\",B76+1)","v":""}]
[null,""]
[null,""]
[null,""]
[null,""]
[null,""]
[null,""]
[null,""]
[null,""]
[null,""]
[null,""]
[null,""]
[null,""]
[null,""]
[null,""]
[null,""]
[null,""]
[null,""]
[null,""]
[null,""]
[null,""]
[null,""]
[null,""]
[null,""]
[null,""]
[null,""]
[null,""]
[null,""]
[null,""]
[null,""]
[null,""]
[null,""]
[null,""]
[null,""]
[null,""]
[null,""]
[null,""]
[null,""]
[null,""]
[null,""]
[null,""]
[null,""]
[null,""]
[null,""]
[null,""]
[null,""]
[null,""]
[null,""]
[null,""]
[null,""]
[null,""]
[null,""]
[null,""]
[null,""]
[null,""]
[null,""]
[null,""]
[null,""]
[null,""]
[null,""]
[null,""]
[null,""]
[null,""]
[null,""]
[null,{"$f":"IF(C141=\"\",\"\",B140+1)","v":""}]
[null,""]
[null,""]
[null,""]
[null,""]
[null,""]
[null,""]
[null,""]
[null,""]
[null,""]
[null,""]
[null,""]
[null,""]
[null,""]
[null,""]
[null,""]
[null,""]
[null,""]
[null,""]
[null,""]
[null,""]
[null,""]
[null,""]
[null,""]
[null,""]
[null,""]
[null,""]
[null,""]
[null,""]
[null,""]
[null,""]
[null,""]
[null,""]
[null,""]
[null,""]
[null,""]
[null,""]
[null,""]
[null,""]
[null,""]
[null,""]
[null,""]
[null,""]
[null,""]
[null,""]
[null,""]
[null,""]
[null,""]
[null,""]
[null,""]
[null,""]
[null,""]
[null,""]
[null,""]
[null,""]
[null,""]
[null,""]
[null,""]
[null,""]
[null,""]
[null,""]
[null,""]
[null,""]
[null,""]
[null,{"$f":"IF(C205=\"\",\"\",B204+1)","v":""}]
[null,""]
[null,""]
[null,""]
[null,""]
[null,""]
[null,""]
[null,""]
[null,""]
[null,""]
[null,""]
[null,""]
[null,""]
[null,""]
[null,""]
[null,""]
[null,""]
[null,""]
[null,""]
[null,""]
[null,""]
[null,""]
[null,""]
[null,""]
[null,""]
[null,""]
[null,""]
[null,""]
[null,""]
[null,""]
[null,""]
[null,""]
[null,""]
[null,""]
[null,""]
[null,""]
[null,""]
[null,""]
[null,""]
[null,""]
[null,""]
[null,""]
[null,""]
[null,""]
[null,""]
[null,""]
[null,""]
[null,""]
[null,""]
[null,""]
[null,""]
[null,""]
[null,""]
[null,""]
[null,""]
[null,""]
[null,""]
[null,""]
[null,""]
[null,""]
[null,""]
[null,""]
[null,""]
[null,""]
[null,{"$f":"IF(C269=\"\",\"\",B268+1)","v":""}]
[null,""]
[null,""]
[null,""]
[null,""]
[null,""]
[null,""]
[null,""]
[null,""]
[null,""]
[null,""]
[null,""]
[null,""]
[null,""]
[null,""]
[null,""]
[null,""]
[null,""]
[null,""]
[null,""]
[null,""]
[null,""]
[null,""]
[null,""]
[null,""]
[null,""]
[null,""]
[null,""]
[null,""]
[null,""]
[null,""]
[null,""]
[null,""]
[null,""]
[null,""]
[null,""]
[null,""]
[null,""]
[null,""]
[null,""]
[null,""]
[null,""]
[null,""]
[null,""]
[null,""]
[null,""]
[null,""]
[null,""]
[null,""]
[null,""]
[null,""]
[null,""]
[null,""]
[null,""]
[null,""]
[null,""]
[null,""]
[null,""]
[null,""]
[null,""]
[null,""]
[null,""]
[null,""]
[null,""]
[null,{"$f":"IF(C333=\"\",\"\",B332+1)","v":""}]
[null,""]
[null,""]
[null,""]
[null,""]
[null,""]
[null,""]
[null,""]
[null,""]
[null,""]
[null,""]
[null,""]
[null,""]
[null,""]
[null,""]
[null,""]
[null,""]
[null,""]
[null,""]
[null,""]
[null,""]
[null,""]
[null,""]
[null,""]
[null,""]
[null,""]
[null,""]
[null,""]
[null,""]
[null,""]
[null,""]
[null,""]
[null,""]
[null,""]
[null,""]
[null,""]
[null,""]
[null,""]
[null,""]
[null,""]
[null,""]
[null,""]
[null,""]
[null,""]
[null,""]
[null,""]
[null,""]
[null,""]
[null,""]
[null,""]
[null,""]
[null,""]
[null,""]
[null,""]
[null,""]
[null,""]
[null,""]
[null,""]
[null,""]
[null,""]
[null,""]
[null,""]
[null,""]
[null,""]
[null,{"$f":"IF(C397=\"\",\"\",B396+1)","v":""}]
[null,""]
[null,""]
[null,""]
[null,""]
[null,""]
[null,""]
[null,""]
[null,""]
[null,""]
[null,""]
[null,""]
[null,""]
[null,""]
[null,""]
[null,""]
[null,""]
[null,""]
[null,""]
[null,""]
[null,""]
[null,""]
[null,""]
[null,""]
[null,""]
[null,""]
[null,""]
[null,""]
[null,""]
[null,""]
[null,""]
[null,""]
[null,""]
[null,""]
[null,""]
[null,""]
[null,""]
[null,""]
[null,""]
[null,""]
[null,""]
[null,""]
[null,""]
[null,""]
[null,""]
[null,""]
[null,""]
[null,""]
[null,""]
[null,""]
[null,""]
[null,""]
[null,""]
[null,""]
[null,""]
[null,""]
[null,""]
[null,""]
[null,""]
[null,""]
[null,""]
[null,""]
[null,""]
[null,""]
[null,{"$f":"IF(C461=\"\",\"\",B460+1)","v":""}]
[null,""]
[null,""]
[null,""]
[null,""]
[null,""]
[null,""]
[null,""]
[null,""]
[null,""]
[null,""]
[null,""]
[null,""]
[null,""]
[null,""]
[null,""]
[null,""]
[null,""]
[null,""]
[null,""]
[null,""]
[null,""]
[null,""]
[null,""]
[null,""]
[null,""]
[null,""]
[null,""]
[null,""]
[null,""]
[null,""]
[null,""]
[null,""]
[null,""]
[null,""]
[null,""]
[null,""]
[null,""]
[null,""]
[null,""]
[null,""]
[null,""]
[null,""]
[null,""]
[null,""]
[null,""]
[null,""]
[null,""]
[null,""]
[null,""]
[]
[null,null,null,null,null,null,null,null,null,null,null,null,null,null,null,null,null,null,null,null,null,null,null,null,null,null,null,null,null,null,null,null,null,null,"Totais pagas",{"$f":"SUM(AJ11:AJ510)","v":0},{"$f":"SUM(AK11:AK510)","v":0},0,0,0,{"$f":"SUM(AO11:AO510)","v":0}]

{"sheet":"Guia 15","index":14,"n_rows":512,"n_cols":46,"rows_kept":512,"cut":false,"hidden":true,"merged":[[4,2,4,8],[5,4,5,7],[6,2,6,5],[6,6,6,9],[6,10,6,11],[7,19,8,19],[6,15,6,22],[6,23,6,34],[6,35,6,45],[7,2,8,2],[7,3,8,3],[7,4,8,4],[7,5,8,5],[7,6,8,6],[7,7,8,7],[7,8,8,8],[6,14,8,14],[7,9,8,9],[7,10,8,10],[7,11,8,11],[7,12,8,12],[7,13,8,13],[7,15,8,15],[7,16,8,16],[7,17,8,17],[7,18,8,18],[7,35,7,40],[7,41,7,43],[7,44,7,45],[7,20,8,20],[7,21,8,21],[7,22,8,22],[7,23,7,28],[7,29,7,31],[7,32,7,34]]}
[]
[null,null,"Superior Tribunal de Justiça"]
[null,null,"Secretaria de Processamento de Feitos"]
[null,null,"Coordenadoria de Processamento de Feitos em Execução Judicial"]
[null,null,{"$f":"\"Relação das Requisições de Pequeno Valor - RPV pagas pelo STJ em \"&IF(F11=\"\",\"\",UPPER((TEXT(F11,\"mmmm/aaaa\"))))","v":"Relação das Requisições de Pequeno Valor - RPV pagas pelo STJ em "}]
[]
[null,null,"RPV",null,null,null,"P R O C E S S O     D E     O R I G E M",null,null,null,"E N T I D A D E S",null,"R E Q U E R E N T E","A D V O G A D O","Natureza do crédito","I N D I C A D O R E S",null,null,null,null,null,null,null,"VALORES REQUISITADOS",null,null,null,null,null,null,null,null,null,null,null,"VALORES ATUALIZADOS PARA PAGAMENTO"]
[null,null,"Nº","Registro","Autuada em","data do pgto","Ação","Autuada em","Tipo de causa","Trânsito","Entidade devedora","Órgão de origem","Origem do crédito","Origem do crédito",null,"Tributário","EC 94 2016","Lei 13.463 2017","PRC/RPV de origem","Nº DA GRU","DOENÇA GRAVE","Deficiência física","Isento de IR","Beneficiários",null,null,null,null,null,"PSSS",null,null,"R R A",null,null,"Beneficiários",null,null,null,null,null,"P S S S",null,null,"R R A"]
[null,null,null,null,null,null,null,null,null,null,null,null,null,null,null,null,null,null,null,null,null,null,null,"Total","Adv I","Adv II","Adv III","Adv IV","Requerente","Base","Desc","Patronal","NMA","Exercícios anteriores","Desconto","Total","Adv I","Adv II","Adv III","Adv IV","Reqte","BASE desc","Desc","Patronal","Exercícios anteriores","Dedução"]
[]
[null,{"$f":"IF(C11=\"\",\"\",1)","v":""}]
[null,{"$f":"IF(C12=\"\",\"\",B11+1)","v":""}]
[null,{"$f":"IF(C13=\"\",\"\",B12+1)","v":""}]
[null,""]
[null,""]
[null,""]
[null,""]
[null,""]
[null,""]
[null,""]
[null,""]
[null,""]
[null,""]
[null,""]
[null,""]
[null,""]
[null,""]
[null,""]
[null,""]
[null,""]
[null,""]
[null,""]
[null,""]
[null,""]
[null,""]
[null,""]
[null,""]
[null,""]
[null,""]
[null,""]
[null,""]
[null,""]
[null,""]
[null,""]
[null,""]
[null,""]
[null,""]
[null,""]
[null,""]
[null,""]
[null,""]
[null,""]
[null,""]
[null,""]
[null,""]
[null,""]
[null,""]
[null,""]
[null,""]
[null,""]
[null,""]
[null,""]
[null,""]
[null,""]
[null,""]
[null,""]
[null,""]
[null,""]
[null,""]
[null,""]
[null,""]
[null,""]
[null,""]
[null,""]
[null,""]
[null,""]
[null,{"$f":"IF(C77=\"\",\"\",B76+1)","v":""}]
[null,""]
[null,""]
[null,""]
[null,""]
[null,""]
[null,""]
[null,""]
[null,""]
[null,""]
[null,""]
[null,""]
[null,""]
[null,""]
[null,""]
[null,""]
[null,""]
[null,""]
[null,""]
[null,""]
[null,""]
[null,""]
[null,""]
[null,""]
[null,""]
[null,""]
[null,""]
[null,""]
[null,""]
[null,""]
[null,""]
[null,""]
[null,""]
[null,""]
[null,""]
[null,""]
[null,""]
[null,""]
[null,""]
[null,""]
[null,""]
[null,""]
[null,""]
[null,""]
[null,""]
[null,""]
[null,""]
[null,""]
[null,""]
[null,""]
[null,""]
[null,""]
[null,""]
[null,""]
[null,""]
[null,""]
[null,""]
[null,""]
[null,""]
[null,""]
[null,""]
[null,""]
[null,""]
[null,""]
[null,{"$f":"IF(C141=\"\",\"\",B140+1)","v":""}]
[null,""]
[null,""]
[null,""]
[null,""]
[null,""]
[null,""]
[null,""]
[null,""]
[null,""]
[null,""]
[null,""]
[null,""]
[null,""]
[null,""]
[null,""]
[null,""]
[null,""]
[null,""]
[null,""]
[null,""]
[null,""]
[null,""]
[null,""]
[null,""]
[null,""]
[null,""]
[null,""]
[null,""]
[null,""]
[null,""]
[null,""]
[null,""]
[null,""]
[null,""]
[null,""]
[null,""]
[null,""]
[null,""]
[null,""]
[null,""]
[null,""]
[null,""]
[null,""]
[null,""]
[null,""]
[null,""]
[null,""]
[null,""]
[null,""]
[null,""]
[null,""]
[null,""]
[null,""]
[null,""]
[null,""]
[null,""]
[null,""]
[null,""]
[null,""]
[null,""]
[null,""]
[null,""]
[null,""]
[null,{"$f":"IF(C205=\"\",\"\",B204+1)","v":""}]
[null,""]
[null,""]
[null,""]
[null,""]
[null,""]
[null,""]
[null,""]
[null,""]
[null,""]
[null,""]
[null,""]
[null,""]
[null,""]
[null,""]
[null,""]
[null,""]
[null,""]
[null,""]
[null,""]
[null,""]
[null,""]
[null,""]
[null,""]
[null,""]
[null,""]
[null,""]
[null,""]
[null,""]
[null,""]
[null,""]
[null,""]
[null,""]
[null,""]
[null,""]
[null,""]
[null,""]
[null,""]
[null,""]
[null,""]
[null,""]
[null,""]
[null,""]
[null,""]
[null,""]
[null,""]
[null,""]
[null,""]
[null,""]
[null,""]
[null,""]
[null,""]
[null,""]
[null,""]
[null,""]
[null,""]
[null,""]
[null,""]
[null,""]
[null,""]
[null,""]
[null,""]
[null,""]
[null,""]
[null,{"$f":"IF(C269=\"\",\"\",B268+1)","v":""}]
[null,""]
[null,""]
[null,""]
[null,""]
[null,""]
[null,""]
[null,""]
[null,""]
[null,""]
[null,""]
[null,""]
[null,""]
[null,""]
[null,""]
[null,""]
[null,""]
[null,""]
[null,""]
[null,""]
[null,""]
[null,""]
[null,""]
[null,""]
[null,""]
[null,""]
[null,""]
[null,""]
[null,""]
[null,""]
[null,""]
[null,""]
[null,""]
[null,""]
[null,""]
[null,""]
[null,""]
[null,""]
[null,""]
[null,""]
[null,""]
[null,""]
[null,""]
[null,""]
[null,""]
[null,""]
[null,""]
[null,""]
[null,""]
[null,""]
[null,""]
[null,""]
[null,""]
[null,""]
[null,""]
[null,""]
[null,""]
[null,""]
[null,""]
[null,""]
[null,""]
[null,""]
[null,""]
[null,""]
[null,{"$f":"IF(C333=\"\",\"\",B332+1)","v":""}]
[null,""]
[null,""]
[null,""]
[null,""]
[null,""]
[null,""]
[null,""]
[null,""]
[null,""]
[null,""]
[null,""]
[null,""]
[null,""]
[null,""]
[null,""]
[null,""]
[null,""]
[null,""]
[null,""]
[null,""]
[null,""]
[null,""]
[null,""]
[null,""]
[null,""]
[null,""]
[null,""]
[null,""]
[null,""]
[null,""]
[null,""]
[null,""]
[null,""]
[null,""]
[null,""]
[null,""]
[null,""]
[null,""]
[null,""]
[null,""]
[null,""]
[null,""]
[null,""]
[null,""]
[null,""]
[null,""]
[null,""]
[null,""]
[null,""]
[null,""]
[null,""]
[null,""]
[null,""]
[null,""]
[null,""]
[null,""]
[null,""]
[null,""]
[null,""]
[null,""]
[null,""]
[null,""]
[null,""]
[null,{"$f":"IF(C397=\"\",\"\",B396+1)","v":""}]
[null,""]
[null,""]
[null,""]
[null,""]
[null,""]
[null,""]
[null,""]
[null,""]
[null,""]
[null,""]
[null,""]
[null,""]
[null,""]
[null,""]
[null,""]
[null,""]
[null,""]
[null,""]
[null,""]
[null,""]
[null,""]
[null,""]
[null,""]
[null,""]
[null,""]
[null,""]
[null,""]
[null,""]
[null,""]
[null,""]
[null,""]
[null,""]
[null,""]
[null,""]
[null,""]
[null,""]
[null,""]
[null,""]
[null,""]
[null,""]
[null,""]
[null,""]
[null,""]
[null,""]
[null,""]
[null,""]
[null,""]
[null,""]
[null,""]
[null,""]
[null,""]
[null,""]
[null,""]
[null,""]
[null,""]
[null,""]
[null,""]
[null,""]
[null,""]
[null,""]
[null,""]
[null,""]
[null,""]
[null,{"$f":"IF(C461=\"\",\"\",B460+1)","v":""}]
[null,""]
[null,""]
[null,""]
[null,""]
[null,""]
[null,""]
[null,""]
[null,""]
[null,""]
[null,""]
[null,""]
[null,""]
[null,""]
[null,""]
[null,""]
[null,""]
[null,""]
[null,""]
[null,""]
[null,""]
[null,""]
[null,""]
[null,""]
[null,""]
[null,""]
[null,""]
[null,""]
[null,""]
[null,""]
[null,""]
[null,""]
[null,""]
[null,""]
[null,""]
[null,""]
[null,""]
[null,""]
[null,""]
[null,""]
[null,""]
[null,""]
[null,""]
[null,""]
[null,""]
[null,""]
[null,""]
[null,""]
[null,""]
[null,""]
[]
[null,null,null,null,null,null,null,null,null,null,null,null,null,null,null,null,null,null,null,null,null,null,null,null,null,null,null,null,null,null,null,null,null,null,"Totais pagas",{"$f":"SUM(AJ11:AJ510)","v":0},{"$f":"SUM(AK11:AK510)","v":0},0,0,0,{"$f":"SUM(AO11:AO510)","v":0}]

{"sheet":"Guia 16","index":15,"n_rows":512,"n_cols":46,"rows_kept":512,"cut":false,"hidden":true,"merged":[[4,2,4,8],[5,4,5,7],[6,2,6,5],[6,6,6,9],[6,10,6,11],[7,19,8,19],[6,15,6,22],[6,23,6,34],[6,35,6,45],[7,2,8,2],[7,3,8,3],[7,4,8,4],[7,5,8,5],[7,6,8,6],[7,7,8,7],[7,8,8,8],[6,14,8,14],[7,9,8,9],[7,10,8,10],[7,11,8,11],[7,12,8,12],[7,13,8,13],[7,15,8,15],[7,16,8,16],[7,17,8,17],[7,18,8,18],[7,35,7,40],[7,41,7,43],[7,44,7,45],[7,20,8,20],[7,21,8,21],[7,22,8,22],[7,23,7,28],[7,29,7,31],[7,32,7,34]]}
[]
[null,null,"Superior Tribunal de Justiça"]
[null,null,"Secretaria de Processamento de Feitos"]
[null,null,"Coordenadoria de Processamento de Feitos em Execução Judicial"]
[null,null,{"$f":"\"Relação das Requisições de Pequeno Valor - RPV pagas pelo STJ em \"&IF(F11=\"\",\"\",UPPER((TEXT(F11,\"mmmm/aaaa\"))))","v":"Relação das Requisições de Pequeno Valor - RPV pagas pelo STJ em "}]
[]
[null,null,"RPV",null,null,null,"P R O C E S S O     D E     O R I G E M",null,null,null,"E N T I D A D E S",null,"R E Q U E R E N T E","A D V O G A D O","Natureza do crédito","I N D I C A D O R E S",null,null,null,null,null,null,null,"VALORES REQUISITADOS",null,null,null,null,null,null,null,null,null,null,null,"VALORES ATUALIZADOS PARA PAGAMENTO"]
[null,null,"Nº","Registro","Autuada em","data do pgto","Ação","Autuada em","Tipo de causa","Trânsito","Entidade devedora","Órgão de origem","Origem do crédito","Origem do crédito",null,"Tributário","EC 94 2016","Lei 13.463 2017","PRC/RPV de origem","Nº DA GRU","DOENÇA GRAVE","Deficiência física","Isento de IR","Beneficiários",null,null,null,null,null,"PSSS",null,null,"R R A",null,null,"Beneficiários",null,null,null,null,null,"P S S S",null,null,"R R A"]
[null,null,null,null,null,null,null,null,null,null,null,null,null,null,null,null,null,null,null,null,null,null,null,"Total","Adv I","Adv II","Adv III","Adv IV","Requerente","Base","Desc","Patronal","NMA","Exercícios anteriores","Desconto","Total","Adv I","Adv II","Adv III","Adv IV","Reqte","BASE desc","Desc","Patronal","Exercícios anteriores","Dedução"]
[]
[null,{"$f":"IF(C11=\"\",\"\",1)","v":""}]
[null,{"$f":"IF(C12=\"\",\"\",B11+1)","v":""}]
[null,{"$f":"IF(C13=\"\",\"\",B12+1)","v":""}]
[null,""]
[null,""]
[null,""]
[null,""]
[null,""]
[null,""]
[null,""]
[null,""]
[null,""]
[null,""]
[null,""]
[null,""]
[null,""]
[null,""]
[null,""]
[null,""]
[null,""]
[null,""]
[null,""]
[null,""]
[null,""]
[null,""]
[null,""]
[null,""]
[null,""]
[null,""]
[null,""]
[null,""]
[null,""]
[null,""]
[null,""]
[null,""]
[null,""]
[null,""]
[null,""]
[null,""]
[null,""]
[null,""]
[null,""]
[null,""]
[null,""]
[null,""]
[null,""]
[null,""]
[null,""]
[null,""]
[null,""]
[null,""]
[null,""]
[null,""]
[null,""]
[null,""]
[null,""]
[null,""]
[null,""]
[null,""]
[null,""]
[null,""]
[null,""]
[null,""]
[null,""]
[null,""]
[null,""]
[null,{"$f":"IF(C77=\"\",\"\",B76+1)","v":""}]
[null,""]
[null,""]
[null,""]
[null,""]
[null,""]
[null,""]
[null,""]
[null,""]
[null,""]
[null,""]
[null,""]
[null,""]
[null,""]
[null,""]
[null,""]
[null,""]
[null,""]
[null,""]
[null,""]
[null,""]
[null,""]
[null,""]
[null,""]
[null,""]
[null,""]
[null,""]
[null,""]
[null,""]
[null,""]
[null,""]
[null,""]
[null,""]
[null,""]
[null,""]
[null,""]
[null,""]
[null,""]
[null,""]
[null,""]
[null,""]
[null,""]
[null,""]
[null,""]
[null,""]
[null,""]
[null,""]
[null,""]
[null,""]
[null,""]
[null,""]
[null,""]
[null,""]
[null,""]
[null,""]
[null,""]
[null,""]
[null,""]
[null,""]
[null,""]
[null,""]
[null,""]
[null,""]
[null,""]
[null,{"$f":"IF(C141=\"\",\"\",B140+1)","v":""}]
[null,""]
[null,""]
[null,""]
[null,""]
[null,""]
[null,""]
[null,""]
[null,""]
[null,""]
[null,""]
[null,""]
[null,""]
[null,""]
[null,""]
[null,""]
[null,""]
[null,""]
[null,""]
[null,""]
[null,""]
[null,""]
[null,""]
[null,""]
[null,""]
[null,""]
[null,""]
[null,""]
[null,""]
[null,""]
[null,""]
[null,""]
[null,""]
[null,""]
[null,""]
[null,""]
[null,""]
[null,""]
[null,""]
[null,""]
[null,""]
[null,""]
[null,""]
[null,""]
[null,""]
[null,""]
[null,""]
[null,""]
[null,""]
[null,""]
[null,""]
[null,""]
[null,""]
[null,""]
[null,""]
[null,""]
[null,""]
[null,""]
[null,""]
[null,""]
[null,""]
[null,""]
[null,""]
[null,""]
[null,{"$f":"IF(C205=\"\",\"\",B204+1)","v":""}]
[null,""]
[null,""]
[null,""]
[null,""]
[null,""]
[null,""]
[null,""]
[null,""]
[null,""]
[null,""]
[null,""]
[null,""]
[null,""]
[null,""]
[null,""]
[null,""]
[null,""]
[null,""]
[null,""]
[null,""]
[null,""]
[null,""]
[null,""]
[null,""]
[null,""]
[null,""]
[null,""]
[null,""]
[null,""]
[null,""]
[null,""]
[null,""]
[null,""]
[null,""]
[null,""]
[null,""]
[null,""]
[null,""]
[null,""]
[null,""]
[null,""]
[null,""]
[null,""]
[null,""]
[null,""]
[null,""]
[null,""]
[null,""]
[null,""]
[null,""]
[null,""]
[null,""]
[null,""]
[null,""]
[null,""]
[null,""]
[null,""]
[null,""]
[null,""]
[null,""]
[null,""]
[null,""]
[null,""]
[null,{"$f":"IF(C269=\"\",\"\",B268+1)","v":""}]
[null,""]
[null,""]
[null,""]
[null,""]
[null,""]
[null,""]
[null,""]
[null,""]
[null,""]
[null,""]
[null,""]
[null,""]
[null,""]
[null,""]
[null,""]
[null,""]
[null,""]
[null,""]
[null,""]
[null,""]
[null,""]
[null,""]
[null,""]
[null,""]
[null,""]
[null,""]
[null,""]
[null,""]
[null,""]
[null,""]
[null,""]
[null,""]
[null,""]
[null,""]
[null,""]
[null,""]
[null,""]
[null,""]
[null,""]
[null,""]
[null,""]
[null,""]
[null,""]
[null,""]
[null,""]
[null,""]
[null,""]
[null,""]
[null,""]
[null,""]
[null,""]
[null,""]
[null,""]
[null,""]
[null,""]
[null,""]
[null,""]
[null,""]
[null,""]
[null,""]
[null,""]
[null,""]
[null,""]
[null,{"$f":"IF(C333=\"\",\"\",B332+1)","v":""}]
[null,""]
[null,""]
[null,""]
[null,""]
[null,""]
[null,""]
[null,""]
[null,""]
[null,""]
[null,""]
[null,""]
[null,""]
[null,""]
[null,""]
[null,""]
[null,""]
[null,""]
[null,""]
[null,""]
[null,""]
[null,""]
[null,""]
[null,""]
[null,""]
[null,""]
[null,""]
[null,""]
[null,""]
[null,""]
[null,""]
[null,""]
[null,""]
[null,""]
[null,""]
[null,""]
[null,""]
[null,""]
[null,""]
[null,""]
[null,""]
[null,""]
[null,""]
[null,""]
[null,""]
[null,""]
[null,""]
[null,""]
[null,""]
[null,""]
[null,""]
[null,""]
[null,""]
[null,""]
[null,""]
[null,""]
[null,""]
[null,""]
[null,""]
[null,""]
[null,""]
[null,""]
[null,""]
[null,""]
[null,{"$f":"IF(C397=\"\",\"\",B396+1)","v":""}]
[null,""]
[null,""]
[null,""]
[null,""]
[null,""]
[null,""]
[null,""]
[null,""]
[null,""]
[null,""]
[null,""]
[null,""]
[null,""]
[null,""]
[null,""]
[null,""]
[null,""]
[null,""]
[null,""]
[null,""]
[null,""]
[null,""]
[null,""]
[null,""]
[null,""]
[null,""]
[null,""]
[null,""]
[null,""]
[null,""]
[null,""]
[null,""]
[null,""]
[null,""]
[null,""]
[null,""]
[null,""]
[null,""]
[null,""]
[null,""]
[null,""]
[null,""]
[null,""]
[null,""]
[null,""]
[null,""]
[null,""]
[null,""]
[null,""]
[null,""]
[null,""]
[null,""]
[null,""]
[null,""]
[null,""]
[null,""]
[null,""]
[null,""]
[null,""]
[null,""]
[null,""]
[null,""]
[null,""]
[null,{"$f":"IF(C461=\"\",\"\",B460+1)","v":""}]
[null,""]
[null,""]
[null,""]
[null,""]
[null,""]
[null,""]
[null,""]
[null,""]
[null,""]
[null,""]
[null,""]
[null,""]
[null,""]
[null,""]
[null,""]
[null,""]
[null,""]
[null,""]
[null,""]
[null,""]
[null,""]
[null,""]
[null,""]
[null,""]
[null,""]
[null,""]
[null,""]
[null,""]
[null,""]
[null,""]
[null,""]
[null,""]
[null,""]
[null,""]
[null,""]
[null,""]
[null,""]
[null,""]
[null,""]
[null,""]
[null,""]
[null,""]
[null,""]
[null,""]
[null,""]
[null,""]
[null,""]
[null,""]
[null,""]
[]
[null,null,null,null,null,null,null,null,null,null,null,null,null,null,null,null,null,null,null,null,null,null,null,null,null,null,null,null,null,null,null,null,null,null,"Totais pagas",{"$f":"SUM(AJ11:AJ510)","v":0},{"$f":"SUM(AK11:AK510)","v":0},0,0,0,{"$f":"SUM(AO11:AO510)","v":0}]

{"sheet":"Guia 17","index":16,"n_rows":512,"n_cols":46,"rows_kept":512,"cut":false,"hidden":true,"merged":[[4,2,4,8],[5,4,5,7],[6,2,6,5],[6,6,6,9],[6,10,6,11],[7,19,8,19],[6,15,6,22],[6,23,6,34],[6,35,6,45],[7,2,8,2],[7,3,8,3],[7,4,8,4],[7,5,8,5],[7,6,8,6],[7,7,8,7],[7,8,8,8],[6,14,8,14],[7,9,8,9],[7,10,8,10],[7,11,8,11],[7,12,8,12],[7,13,8,13],[7,15,8,15],[7,16,8,16],[7,17,8,17],[7,18,8,18],[7,35,7,40],[7,41,7,43],[7,44,7,45],[7,20,8,20],[7,21,8,21],[7,22,8,22],[7,23,7,28],[7,29,7,31],[7,32,7,34]]}
[]
[null,null,"Superior Tribunal de Justiça"]
[null,null,"Secretaria de Processamento de Feitos"]
[null,null,"Coordenadoria de Processamento de Feitos em Execução Judicial"]
[null,null,{"$f":"\"Relação das Requisições de Pequeno Valor - RPV pagas pelo STJ em \"&IF(F11=\"\",\"\",UPPER((TEXT(F11,\"mmmm/aaaa\"))))","v":"Relação das Requisições de Pequeno Valor - RPV pagas pelo STJ em "}]
[]
[null,null,"RPV",null,null,null,"P R O C E S S O     D E     O R I G E M",null,null,null,"E N T I D A D E S",null,"R E Q U E R E N T E","A D V O G A D O","Natureza do crédito","I N D I C A D O R E S",null,null,null,null,null,null,null,"VALORES REQUISITADOS",null,null,null,null,null,null,null,null,null,null,null,"VALORES ATUALIZADOS PARA PAGAMENTO"]
[null,null,"Nº","Registro","Autuada em","data do pgto","Ação","Autuada em","Tipo de causa","Trânsito","Entidade devedora","Órgão de origem","Origem do crédito","Origem do crédito",null,"Tributário","EC 94 2016","Lei 13.463 2017","PRC/RPV de origem","Nº DA GRU","DOENÇA GRAVE","Deficiência física","Isento de IR","Beneficiários",null,null,null,null,null,"PSSS",null,null,"R R A",null,null,"Beneficiários",null,null,null,null,null,"P S S S",null,null,"R R A"]
[null,null,null,null,null,null,null,null,null,null,null,null,null,null,null,null,null,null,null,null,null,null,null,"Total","Adv I","Adv II","Adv III","Adv IV","Requerente","Base","Desc","Patronal","NMA","Exercícios anteriores","Desconto","Total","Adv I","Adv II","Adv III","Adv IV","Reqte","BASE desc","Desc","Patronal","Exercícios anteriores","Dedução"]
[]
[null,{"$f":"IF(C11=\"\",\"\",1)","v":""}]
[null,{"$f":"IF(C12=\"\",\"\",B11+1)","v":""}]
[null,{"$f":"IF(C13=\"\",\"\",B12+1)","v":""}]
[null,""]
[null,""]
[null,""]
[null,""]
[null,""]
[null,""]
[null,""]
[null,""]
[null,""]
[null,""]
[null,""]
[null,""]
[null,""]
[null,""]
[null,""]
[null,""]
[null,""]
[null,""]
[null,""]
[null,""]
[null,""]
[null,""]
[null,""]
[null,""]
[null,""]
[null,""]
[null,""]
[null,""]
[null,""]
[null,""]
[null,""]
[null,""]
[null,""]
[null,""]
[null,""]
[null,""]
[null,""]
[null,""]
[null,""]
[null,""]
[null,""]
[null,""]
[null,""]
[null,""]
[null,""]
[null,""]
[null,""]
[null,""]
[null,""]
[null,""]
[null,""]
[null,""]
[null,""]
[null,""]
[null,""]
[null,""]
[null,""]
[null,""]
[null,""]
[null,""]
[null,""]
[null,""]
[null,""]
[null,{"$f":"IF(C77=\"\",\"\",B76+1)","v":""}]
[null,""]
[null,""]
[null,""]
[null,""]
[null,""]
[null,""]
[null,""]
[null,""]
[null,""]
[null,""]
[null,""]
[null,""]
[null,""]
[null,""]
[null,""]
[null,""]
[null,""]
[null,""]
[null,""]
[null,""]
[null,""]
[null,""]
[null,""]
[null,""]
[null,""]
[null,""]
[null,""]
[null,""]
[null,""]
[null,""]
[null,""]
[null,""]
[null,""]
[null,""]
[null,""]
[null,""]
[null,""]
[null,""]
[null,""]
[null,""]
[null,""]
[null,""]
[null,""]
[null,""]
[null,""]
[null,""]
[null,""]
[null,""]
[null,""]
[null,""]
[null,""]
[null,""]
[null,""]
[null,""]
[null,""]
[null,""]
[null,""]
[null,""]
[null,""]
[null,""]
[null,""]
[null,""]
[null,""]
[null,{"$f":"IF(C141=\"\",\"\",B140+1)","v":""}]
[null,""]
[null,""]
[null,""]
[null,""]
[null,""]
[null,""]
[null,""]
[null,""]
[null,""]
[null,""]
[null,""]
[null,""]
[null,""]
[null,""]
[null,""]
[null,""]
[null,""]
[null,""]
[null,""]
[null,""]
[null,""]
[null,""]
[null,""]
[null,""]
[null,""]
[null,""]
[null,""]
[null,""]
[null,""]
[null,""]
[null,""]
[null,""]
[null,""]
[null,""]
[null,""]
[null,""]
[null,""]
[null,""]
[null,""]
[null,""]
[null,""]
[null,""]
[null,""]
[null,""]
[null,""]
[null,""]
[null,""]
[null,""]
[null,""]
[null,""]
[null,""]
[null,""]
[null,""]
[null,""]
[null,""]
[null,""]
[null,""]
[null,""]
[null,""]
[null,""]
[null,""]
[null,""]
[null,""]
[null,{"$f":"IF(C205=\"\",\"\",B204+1)","v":""}]
[null,""]
[null,""]
[null,""]
[null,""]
[null,""]
[null,""]
[null,""]
[null,""]
[null,""]
[null,""]
[null,""]
[null,""]
[null,""]
[null,""]
[null,""]
[null,""]
[null,""]
[null,""]
[null,""]
[null,""]
[null,""]
[null,""]
[null,""]
[null,""]
[null,""]
[null,""]
[null,""]
[null,""]
[null,""]
[null,""]
[null,""]
[null,""]
[null,""]
[null,""]
[null,""]
[null,""]
[null,""]
[null,""]
[null,""]
[null,""]
[null,""]
[null,""]
[null,""]
[null,""]
[null,""]
[null,""]
[null,""]
[null,""]
[null,""]
[null,""]
[null,""]
[null,""]
[null,""]
[null,""]
[null,""]
[null,""]
[null,""]
[null,""]
[null,""]
[null,""]
[null,""]
[null,""]
[null,""]
[null,{"$f":"IF(C269=\"\",\"\",B268+1)","v":""}]
[null,""]
[null,""]
[null,""]
[null,""]
[null,""]
[null,""]
[null,""]
[null,""]
[null,""]
[null,""]
[null,""]
[null,""]
[null,""]
[null,""]
[null,""]
[null,""]
[null,""]
[null,""]
[null,""]
[null,""]
[null,""]
[null,""]
[null,""]
[null,""]
[null,""]
[null,""]
[null,""]
[null,""]
[null,""]
[null,""]
[null,""]
[null,""]
[null,""]
[null,""]
[null,""]
[null,""]
[null,""]
[null,""]
[null,""]
[null,""]
[null,""]
[null,""]
[null,""]
[null,""]
[null,""]
[null,""]
[null,""]
[null,""]
[null,""]
[null,""]
[null,""]
[null,""]
[null,""]
[null,""]
[null,""]
[null,""]
[null,""]
[null,""]
[null,""]
[null,""]
[null,""]
[null,""]
[null,""]
[null,{"$f":"IF(C333=\"\",\"\",B332+1)","v":""}]
[null,""]
[null,""]
[null,""]
[null,""]
[null,""]
[null,""]
[null,""]
[null,""]
[null,""]
[null,""]
[null,""]
[null,""]
[null,""]
[null,""]
[null,""]
[null,""]
[null,""]
[null,""]
[null,""]
[null,""]
[null,""]
[null,""]
[null,""]
[null,""]
[null,""]
[null,""]
[null,""]
[null,""]
[null,""]
[null,""]
[null,""]
[null,""]
[null,""]
[null,""]
[null,""]
[null,""]
[null,""]
[null,""]
[null,""]
[null,""]
[null,""]
[null,""]
[null,""]
[null,""]
[null,""]
[null,""]
[null,""]
[null,""]
[null,""]
[null,""]
[null,""]
[null,""]
[null,""]
[null,""]
[null,""]
[null,""]
[null,""]
[null,""]
[null,""]
[null,""]
[null,""]
[null,""]
[null,""]
[null,{"$f":"IF(C397=\"\",\"\",B396+1)","v":""}]
[null,""]
[null,""]
[null,""]
[null,""]
[null,""]
[null,""]
[null,""]
[null,""]
[null,""]
[null,""]
[null,""]
[null,""]
[null,""]
[null,""]
[null,""]
[null,""]
[null,""]
[null,""]
[null,""]
[null,""]
[null,""]
[null,""]
[null,""]
[null,""]
[null,""]
[null,""]
[null,""]
[null,""]
[null,""]
[null,""]
[null,""]
[null,""]
[null,""]
[null,""]
[null,""]
[null,""]
[null,""]
[null,""]
[null,""]
[null,""]
[null,""]
[null,""]
[null,""]
[null,""]
[null,""]
[null,""]
[null,""]
[null,""]
[null,""]
[null,""]
[null,""]
[null,""]
[null,""]
[null,""]
[null,""]
[null,""]
[null,""]
[null,""]
[null,""]
[null,""]
[null,""]
[null,""]
[null,""]
[null,{"$f":"IF(C461=\"\",\"\",B460+1)","v":""}]
[null,""]
[null,""]
[null,""]
[null,""]
[null,""]
[null,""]
[null,""]
[null,""]
[null,""]
[null,""]
[null,""]
[null,""]
[null,""]
[null,""]
[null,""]
[null,""]
[null,""]
[null,""]
[null,""]
[null,""]
[null,""]
[null,""]
[null,""]
[null,""]
[null,""]
[null,""]
[null,""]
[null,""]
[null,""]
[null,""]
[null,""]
[null,""]
[null,""]
[null,""]
[null,""]
[null,""]
[null,""]
[null,""]
[null,""]
[null,""]
[null,""]
[null,""]
[null,""]
[null,""]
[null,""]
[null,""]
[null,""]
[null,""]
[null,""]
[]
[null,null,null,null,null,null,null,null,null,null,null,null,null,null,null,null,null,null,null,null,null,null,null,null,null,null,null,null,null,null,null,null,null,null,"Totais pagas",{"$f":"SUM(AJ11:AJ510)","v":0},{"$f":"SUM(AK11:AK510)","v":0},0,0,0,{"$f":"SUM(AO11:AO510)","v":0}]

{"sheet":"Guia 18","index":17,"n_rows":512,"n_cols":46,"rows_kept":512,"cut":false,"hidden":true,"merged":[[4,2,4,8],[5,4,5,7],[6,2,6,5],[6,6,6,9],[6,10,6,11],[7,19,8,19],[6,15,6,22],[6,23,6,34],[6,35,6,45],[7,2,8,2],[7,3,8,3],[7,4,8,4],[7,5,8,5],[7,6,8,6],[7,7,8,7],[7,8,8,8],[6,14,8,14],[7,9,8,9],[7,10,8,10],[7,11,8,11],[7,12,8,12],[7,13,8,13],[7,15,8,15],[7,16,8,16],[7,17,8,17],[7,18,8,18],[7,35,7,40],[7,41,7,43],[7,44,7,45],[7,20,8,20],[7,21,8,21],[7,22,8,22],[7,23,7,28],[7,29,7,31],[7,32,7,34]]}
[]
[null,null,"Superior Tribunal de Justiça"]
[null,null,"Secretaria de Processamento de Feitos"]
[null,null,"Coordenadoria de Processamento de Feitos em Execução Judicial"]
[null,null,{"$f":"\"Relação das Requisições de Pequeno Valor - RPV pagas pelo STJ em \"&IF(F11=\"\",\"\",UPPER((TEXT(F11,\"mmmm/aaaa\"))))","v":"Relação das Requisições de Pequeno Valor - RPV pagas pelo STJ em "}]
[]
[null,null,"RPV",null,null,null,"P R O C E S S O     D E     O R I G E M",null,null,null,"E N T I D A D E S",null,"R E Q U E R E N T E","A D V O G A D O","Natureza do crédito","I N D I C A D O R E S",null,null,null,null,null,null,null,"VALORES REQUISITADOS",null,null,null,null,null,null,null,null,null,null,null,"VALORES ATUALIZADOS PARA PAGAMENTO"]
[null,null,"Nº","Registro","Autuada em","data do pgto","Ação","Autuada em","Tipo de causa","Trânsito","Entidade devedora","Órgão de origem","Origem do crédito","Origem do crédito",null,"Tributário","EC 94 2016","Lei 13.463 2017","PRC/RPV de origem","Nº DA GRU","DOENÇA GRAVE","Deficiência física","Isento de IR","Beneficiários",null,null,null,null,null,"PSSS",null,null,"R R A",null,null,"Beneficiários",null,null,null,null,null,"P S S S",null,null,"R R A"]
[null,null,null,null,null,null,null,null,null,null,null,null,null,null,null,null,null,null,null,null,null,null,null,"Total","Adv I","Adv II","Adv III","Adv IV","Requerente","Base","Desc","Patronal","NMA","Exercícios anteriores","Desconto","Total","Adv I","Adv II","Adv III","Adv IV","Reqte","BASE desc","Desc","Patronal","Exercícios anteriores","Dedução"]
[]
[null,{"$f":"IF(C11=\"\",\"\",1)","v":""}]
[null,{"$f":"IF(C12=\"\",\"\",B11+1)","v":""}]
[null,{"$f":"IF(C13=\"\",\"\",B12+1)","v":""}]
[null,""]
[null,""]
[null,""]
[null,""]
[null,""]
[null,""]
[null,""]
[null,""]
[null,""]
[null,""]
[null,""]
[null,""]
[null,""]
[null,""]
[null,""]
[null,""]
[null,""]
[null,""]
[null,""]
[null,""]
[null,""]
[null,""]
[null,""]
[null,""]
[null,""]
[null,""]
[null,""]
[null,""]
[null,""]
[null,""]
[null,""]
[null,""]
[null,""]
[null,""]
[null,""]
[null,""]
[null,""]
[null,""]
[null,""]
[null,""]
[null,""]
[null,""]
[null,""]
[null,""]
[null,""]
[null,""]
[null,""]
[null,""]
[null,""]
[null,""]
[null,""]
[null,""]
[null,""]
[null,""]
[null,""]
[null,""]
[null,""]
[null,""]
[null,""]
[null,""]
[null,""]
[null,""]
[null,""]
[null,{"$f":"IF(C77=\"\",\"\",B76+1)","v":""}]
[null,""]
[null,""]
[null,""]
[null,""]
[null,""]
[null,""]
[null,""]
[null,""]
[null,""]
[null,""]
[null,""]
[null,""]
[null,""]
[null,""]
[null,""]
[null,""]
[null,""]
[null,""]
[null,""]
[null,""]
[null,""]
[null,""]
[null,""]
[null,""]
[null,""]
[null,""]
[null,""]
[null,""]
[null,""]
[null,""]
[null,""]
[null,""]
[null,""]
[null,""]
[null,""]
[null,""]
[null,""]
[null,""]
[null,""]
[null,""]
[null,""]
[null,""]
[null,""]
[null,""]
[null,""]
[null,""]
[null,""]
[null,""]
[null,""]
[null,""]
[null,""]
[null,""]
[null,""]
[null,""]
[null,""]
[null,""]
[null,""]
[null,""]
[null,""]
[null,""]
[null,""]
[null,""]
[null,""]
[null,{"$f":"IF(C141=\"\",\"\",B140+1)","v":""}]
[null,""]
[null,""]
[null,""]
[null,""]
[null,""]
[null,""]
[null,""]
[null,""]
[null,""]
[null,""]
[null,""]
[null,""]
[null,""]
[null,""]
[null,""]
[null,""]
[null,""]
[null,""]
[null,""]
[null,""]
[null,""]
[null,""]
[null,""]
[null,""]
[null,""]
[null,""]
[null,""]
[null,""]
[null,""]
[null,""]
[null,""]
[null,""]
[null,""]
[null,""]
[null,""]
[null,""]
[null,""]
[null,""]
[null,""]
[null,""]
[null,""]
[null,""]
[null,""]
[null,""]
[null,""]
[null,""]
[null,""]
[null,""]
[null,""]
[null,""]
[null,""]
[null,""]
[null,""]
[null,""]
[null,""]
[null,""]
[null,""]
[null,""]
[null,""]
[null,""]
[null,""]
[null,""]
[null,""]
[null,{"$f":"IF(C205=\"\",\"\",B204+1)","v":""}]
[null,""]
[null,""]
[null,""]
[null,""]
[null,""]
[null,""]
[null,""]
[null,""]
[null,""]
[null,""]
[null,""]
[null,""]
[null,""]
[null,""]
[null,""]
[null,""]
[null,""]
[null,""]
[null,""]
[null,""]
[null,""]
[null,""]
[null,""]
[null,""]
[null,""]
[null,""]
[null,""]
[null,""]
[null,""]
[null,""]
[null,""]
[null,""]
[null,""]
[null,""]
[null,""]
[null,""]
[null,""]
[null,""]
[null,""]
[null,""]
[null,""]
[null,""]
[null,""]
[null,""]
[null,""]
[null,""]
[null,""]
[null,""]
[null,""]
[null,""]
[null,""]
[null,""]
[null,""]
[null,""]
[null,""]
[null,""]
[null,""]
[null,""]
[null,""]
[null,""]
[null,""]
[null,""]
[null,""]
[null,{"$f":"IF(C269=\"\",\"\",B268+1)","v":""}]
[null,""]
[null,""]
[null,""]
[null,""]
[null,""]
[null,""]
[null,""]
[null,""]
[null,""]
[null,""]
[null,""]
[null,""]
[null,""]
[null,""]
[null,""]
[null,""]
[null,""]
[null,""]
[null,""]
[null,""]
[null,""]
[null,""]
[null,""]
[null,""]
[null,""]
[null,""]
[null,""]
[null,""]
[null,""]
[null,""]
[null,""]
[null,""]
[null,""]
[null,""]
[null,""]
[null,""]
[null,""]
[null,""]
[null,""]
[null,""]
[null,""]
[null,""]
[null,""]
[null,""]
[null,""]
[null,""]
[null,""]
[null,""]
[null,""]
[null,""]
[null,""]
[null,""]
[null,""]
[null,""]
[null,""]
[null,""]
[null,""]
[null,""]
[null,""]
[null,""]
[null,""]
[null,""]
[null,""]
[null,{"$f":"IF(C333=\"\",\"\",B332+1)","v":""}]
[null,""]
[null,""]
[null,""]
[null,""]
[null,""]
[null,""]
[null,""]
[null,""]
[null,""]
[null,""]
[null,""]
[null,""]
[null,""]
[null,""]
[null,""]
[null,""]
[null,""]
[null,""]
[null,""]
[null,""]
[null,""]
[null,""]
[null,""]
[null,""]
[null,""]
[null,""]
[null,""]
[null,""]
[null,""]
[null,""]
[null,""]
[null,""]
[null,""]
[null,""]
[null,""]
[null,""]
[null,""]
[null,""]
[null,""]
[null,""]
[null,""]
[null,""]
[null,""]
[null,""]
[null,""]
[null,""]
[null,""]
[null,""]
[null,""]
[null,""]
[null,""]
[null,""]
[null,""]
[null,""]
[null,""]
[null,""]
[null,""]
[null,""]
[null,""]
[null,""]
[null,""]
[null,""]
[null,""]
[null,{"$f":"IF(C397=\"\",\"\",B396+1)","v":""}]
[null,""]
[null,""]
[null,""]
[null,""]
[null,""]
[null,""]
[null,""]
[null,""]
[null,""]
[null,""]
[null,""]
[null,""]
[null,""]
[null,""]
[null,""]
[null,""]
[null,""]
[null,""]
[null,""]
[null,""]
[null,""]
[null,""]
[null,""]
[null,""]
[null,""]
[null,""]
[null,""]
[null,""]
[null,""]
[null,""]
[null,""]
[null,""]
[null,""]
[null,""]
[null,""]
[null,""]
[null,""]
[null,""]
[null,""]
[null,""]
[null,""]
[null,""]
[null,""]
[null,""]
[null,""]
[null,""]
[null,""]
[null,""]
[null,""]
[null,""]
[null,""]
[null,""]
[null,""]
[null,""]
[null,""]
[null,""]
[null,""]
[null,""]
[null,""]
[null,""]
[null,""]
[null,""]
[null,""]
[null,{"$f":"IF(C461=\"\",\"\",B460+1)","v":""}]
[null,""]
[null,""]
[null,""]
[null,""]
[null,""]
[null,""]
[null,""]
[null,""]
[null,""]
[null,""]
[null,""]
[null,""]
[null,""]
[null,""]
[null,""]
[null,""]
[null,""]
[null,""]
[null,""]
[null,""]
[null,""]
[null,""]
[null,""]
[null,""]
[null,""]
[null,""]
[null,""]
[null,""]
[null,""]
[null,""]
[null,""]
[null,""]
[null,""]
[null,""]
[null,""]
[null,""]
[null,""]
[null,""]
[null,""]
[null,""]
[null,""]
[null,""]
[null,""]
[null,""]
[null,""]
[null,""]
[null,""]
[null,""]
[null,""]
[]
[null,null,null,null,null,null,null,null,null,null,null,null,null,null,null,null,null,null,null,null,null,null,null,null,null,null,null,null,null,null,null,null,null,null,"Totais pagas",{"$f":"SUM(AJ11:AJ510)","v":0},{"$f":"SUM(AK11:AK510)","v":0},0,0,0,{"$f":"SUM(AO11:AO510)","v":0}]

{"sheet":"Guia 19","index":18,"n_rows":512,"n_cols":46,"rows_kept":512,"cut":false,"hidden":true,"merged":[[4,2,4,8],[5,4,5,7],[6,2,6,5],[6,6,6,9],[6,10,6,11],[7,19,8,19],[6,15,6,22],[6,23,6,34],[6,35,6,45],[7,2,8,2],[7,3,8,3],[7,4,8,4],[7,5,8,5],[7,6,8,6],[7,7,8,7],[7,8,8,8],[6,14,8,14],[7,9,8,9],[7,10,8,10],[7,11,8,11],[7,12,8,12],[7,13,8,13],[7,15,8,15],[7,16,8,16],[7,17,8,17],[7,18,8,18],[7,35,7,40],[7,41,7,43],[7,44,7,45],[7,20,8,20],[7,21,8,21],[7,22,8,22],[7,23,7,28],[7,29,7,31],[7,32,7,34]]}
[]
[null,null,"Superior Tribunal de Justiça"]
[null,null,"Secretaria de Processamento de Feitos"]
[null,null,"Coordenadoria de Processamento de Feitos em Execução Judicial"]
[null,null,{"$f":"\"Relação das Requisições de Pequeno Valor - RPV pagas pelo STJ em \"&IF(F11=\"\",\"\",UPPER((TEXT(F11,\"mmmm/aaaa\"))))","v":"Relação das Requisições de Pequeno Valor - RPV pagas pelo STJ em "}]
[]
[null,null,"RPV",null,null,null,"P R O C E S S O     D E     O R I G E M",null,null,null,"E N T I D A D E S",null,"R E Q U E R E N T E","A D V O G A D O","Natureza do crédito","I N D I C A D O R E S",null,null,null,null,null,null,null,"VALORES REQUISITADOS",null,null,null,null,null,null,null,null,null,null,null,"VALORES ATUALIZADOS PARA PAGAMENTO"]
[null,null,"Nº","Registro","Autuada em","data do pgto","Ação","Autuada em","Tipo de causa","Trânsito","Entidade devedora","Órgão de origem","Origem do crédito","Origem do crédito",null,"Tributário","EC 94 2016","Lei 13.463 2017","PRC/RPV de origem","Nº DA GRU","DOENÇA GRAVE","Deficiência física","Isento de IR","Beneficiários",null,null,null,null,null,"PSSS",null,null,"R R A",null,null,"Beneficiários",null,null,null,null,null,"P S S S",null,null,"R R A"]
[null,null,null,null,null,null,null,null,null,null,null,null,null,null,null,null,null,null,null,null,null,null,null,"Total","Adv I","Adv II","Adv III","Adv IV","Requerente","Base","Desc","Patronal","NMA","Exercícios anteriores","Desconto","Total","Adv I","Adv II","Adv III","Adv IV","Reqte","BASE desc","Desc","Patronal","Exercícios anteriores","Dedução"]
[]
[null,{"$f":"IF(C11=\"\",\"\",1)","v":""}]
[null,{"$f":"IF(C12=\"\",\"\",B11+1)","v":""}]
[null,{"$f":"IF(C13=\"\",\"\",B12+1)","v":""}]
[null,""]
[null,""]
[null,""]
[null,""]
[null,""]
[null,""]
[null,""]
[null,""]
[null,""]
[null,""]
[null,""]
[null,""]
[null,""]
[null,""]
[null,""]
[null,""]
[null,""]
[null,""]
[null,""]
[null,""]
[null,""]
[null,""]
[null,""]
[null,""]
[null,""]
[null,""]
[null,""]
[null,""]
[null,""]
[null,""]
[null,""]
[null,""]
[null,""]
[null,""]
[null,""]
[null,""]
[null,""]
[null,""]
[null,""]
[null,""]
[null,""]
[null,""]
[null,""]
[null,""]
[null,""]
[null,""]
[null,""]
[null,""]
[null,""]
[null,""]
[null,""]
[null,""]
[null,""]
[null,""]
[null,""]
[null,""]
[null,""]
[null,""]
[null,""]
[null,""]
[null,""]
[null,""]
[null,""]
[null,{"$f":"IF(C77=\"\",\"\",B76+1)","v":""}]
[null,""]
[null,""]
[null,""]
[null,""]
[null,""]
[null,""]
[null,""]
[null,""]
[null,""]
[null,""]
[null,""]
[null,""]
[null,""]
[null,""]
[null,""]
[null,""]
[null,""]
[null,""]
[null,""]
[null,""]
[null,""]
[null,""]
[null,""]
[null,""]
[null,""]
[null,""]
[null,""]
[null,""]
[null,""]
[null,""]
[null,""]
[null,""]
[null,""]
[null,""]
[null,""]
[null,""]
[null,""]
[null,""]
[null,""]
[null,""]
[null,""]
[null,""]
[null,""]
[null,""]
[null,""]
[null,""]
[null,""]
[null,""]
[null,""]
[null,""]
[null,""]
[null,""]
[null,""]
[null,""]
[null,""]
[null,""]
[null,""]
[null,""]
[null,""]
[null,""]
[null,""]
[null,""]
[null,""]
[null,{"$f":"IF(C141=\"\",\"\",B140+1)","v":""}]
[null,""]
[null,""]
[null,""]
[null,""]
[null,""]
[null,""]
[null,""]
[null,""]
[null,""]
[null,""]
[null,""]
[null,""]
[null,""]
[null,""]
[null,""]
[null,""]
[null,""]
[null,""]
[null,""]
[null,""]
[null,""]
[null,""]
[null,""]
[null,""]
[null,""]
[null,""]
[null,""]
[null,""]
[null,""]
[null,""]
[null,""]
[null,""]
[null,""]
[null,""]
[null,""]
[null,""]
[null,""]
[null,""]
[null,""]
[null,""]
[null,""]
[null,""]
[null,""]
[null,""]
[null,""]
[null,""]
[null,""]
[null,""]
[null,""]
[null,""]
[null,""]
[null,""]
[null,""]
[null,""]
[null,""]
[null,""]
[null,""]
[null,""]
[null,""]
[null,""]
[null,""]
[null,""]
[null,""]
[null,{"$f":"IF(C205=\"\",\"\",B204+1)","v":""}]
[null,""]
[null,""]
[null,""]
[null,""]
[null,""]
[null,""]
[null,""]
[null,""]
[null,""]
[null,""]
[null,""]
[null,""]
[null,""]
[null,""]
[null,""]
[null,""]
[null,""]
[null,""]
[null,""]
[null,""]
[null,""]
[null,""]
[null,""]
[null,""]
[null,""]
[null,""]
[null,""]
[null,""]
[null,""]
[null,""]
[null,""]
[null,""]
[null,""]
[null,""]
[null,""]
[null,""]
[null,""]
[null,""]
[null,""]
[null,""]
[null,""]
[null,""]
[null,""]
[null,""]
[null,""]
[null,""]
[null,""]
[null,""]
[null,""]
[null,""]
[null,""]
[null,""]
[null,""]
[null,""]
[null,""]
[null,""]
[null,""]
[null,""]
[null,""]
[null,""]
[null,""]
[null,""]
[null,""]
[null,{"$f":"IF(C269=\"\",\"\",B268+1)","v":""}]
[null,""]
[null,""]
[null,""]
[null,""]
[null,""]
[null,""]
[null,""]
[null,""]
[null,""]
[null,""]
[null,""]
[null,""]
[null,""]
[null,""]
[null,""]
[null,""]
[null,""]
[null,""]
[null,""]
[null,""]
[null,""]
[null,""]
[null,""]
[null,""]
[null,""]
[null,""]
[null,""]
[null,""]
[null,""]
[null,""]
[null,""]
[null,""]
[null,""]
[null,""]
[null,""]
[null,""]
[null,""]
[null,""]
[null,""]
[null,""]
[null,""]
[null,""]
[null,""]
[null,""]
[null,""]
[null,""]
[null,""]
[null,""]
[null,""]
[null,""]
[null,""]
[null,""]
[null,""]
[null,""]
[null,""]
[null,""]
[null,""]
[null,""]
[null,""]
[null,""]
[null,""]
[null,""]
[null,""]
[null,{"$f":"IF(C333=\"\",\"\",B332+1)","v":""}]
[null,""]
[null,""]
[null,""]
[null,""]
[null,""]
[null,""]
[null,""]
[null,""]
[null,""]
[null,""]
[null,""]
[null,""]
[null,""]
[null,""]
[null,""]
[null,""]
[null,""]
[null,""]
[null,""]
[null,""]
[null,""]
[null,""]
[null,""]
[null,""]
[null,""]
[null,""]
[null,""]
[null,""]
[null,""]
[null,""]
[null,""]
[null,""]
[null,""]
[null,""]
[null,""]
[null,""]
[null,""]
[null,""]
[null,""]
[null,""]
[null,""]
[null,""]
[null,""]
[null,""]
[null,""]
[null,""]
[null,""]
[null,""]
[null,""]
[null,""]
[null,""]
[null,""]
[null,""]
[null,""]
[null,""]
[null,""]
[null,""]
[null,""]
[null,""]
[null,""]
[null,""]
[null,""]
[null,""]
[null,{"$f":"IF(C397=\"\",\"\",B396+1)","v":""}]
[null,""]
[null,""]
[null,""]
[null,""]
[null,""]
[null,""]
[null,""]
[null,""]
[null,""]
[null,""]
[null,""]
[null,""]
[null,""]
[null,""]
[null,""]
[null,""]
[null,""]
[null,""]
[null,""]
[null,""]
[null,""]
[null,""]
[null,""]
[null,""]
[null,""]
[null,""]
[null,""]
[null,""]
[null,""]
[null,""]
[null,""]
[null,""]
[null,""]
[null,""]
[null,""]
[null,""]
[null,""]
[null,""]
[null,""]
[null,""]
[null,""]
[null,""]
[null,""]
[null,""]
[null,""]
[null,""]
[null,""]
[null,""]
[null,""]
[null,""]
[null,""]
[null,""]
[null,""]
[null,""]
[null,""]
[null,""]
[null,""]
[null,""]
[null,""]
[null,""]
[null,""]
[null,""]
[null,""]
[null,{"$f":"IF(C461=\"\",\"\",B460+1)","v":""}]
[null,""]
[null,""]
[null,""]
[null,""]
[null,""]
[null,""]
[null,""]
[null,""]
[null,""]
[null,""]
[null,""]
[null,""]
[null,""]
[null,""]
[null,""]
[null,""]
[null,""]
[null,""]
[null,""]
[null,""]
[null,""]
[null,""]
[null,""]
[null,""]
[null,""]
[null,""]
[null,""]
[null,""]
[null,""]
[null,""]
[null,""]
[null,""]
[null,""]
[null,""]
[null,""]
[null,""]
[null,""]
[null,""]
[null,""]
[null,""]
[null,""]
[null,""]
[null,""]
[null,""]
[null,""]
[null,""]
[null,""]
[null,""]
[null,""]
[]
[null,null,null,null,null,null,null,null,null,null,null,null,null,null,null,null,null,null,null,null,null,null,null,null,null,null,null,null,null,null,null,null,null,null,"Totais pagas",{"$f":"SUM(AJ11:AJ510)","v":0},{"$f":"SUM(AK11:AK510)","v":0},0,0,0,{"$f":"SUM(AO11:AO510)","v":0}]

{"sheet":"Guia 20","index":19,"n_rows":512,"n_cols":46,"rows_kept":512,"cut":false,"hidden":true,"merged":[[4,2,4,8],[5,4,5,7],[6,2,6,5],[6,6,6,9],[6,10,6,11],[7,19,8,19],[6,15,6,22],[6,23,6,34],[6,35,6,45],[7,2,8,2],[7,3,8,3],[7,4,8,4],[7,5,8,5],[7,6,8,6],[7,7,8,7],[7,8,8,8],[6,14,8,14],[7,9,8,9],[7,10,8,10],[7,11,8,11],[7,12,8,12],[7,13,8,13],[7,15,8,15],[7,16,8,16],[7,17,8,17],[7,18,8,18],[7,35,7,40],[7,41,7,43],[7,44,7,45],[7,20,8,20],[7,21,8,21],[7,22,8,22],[7,23,7,28],[7,29,7,31],[7,32,7,34]]}
[]
[null,null,"Superior Tribunal de Justiça"]
[null,null,"Secretaria de Processamento de Feitos"]
[null,null,"Coordenadoria de Processamento de Feitos em Execução Judicial"]
[null,null,{"$f":"\"Relação das Requisições de Pequeno Valor - RPV pagas pelo STJ em \"&IF(F11=\"\",\"\",UPPER((TEXT(F11,\"mmmm/aaaa\"))))","v":"Relação das Requisições de Pequeno Valor - RPV pagas pelo STJ em "}]
[]
[null,null,"RPV",null,null,null,"P R O C E S S O     D E     O R I G E M",null,null,null,"E N T I D A D E S",null,"R E Q U E R E N T E","A D V O G A D O","Natureza do crédito","I N D I C A D O R E S",null,null,null,null,null,null,null,"VALORES REQUISITADOS",null,null,null,null,null,null,null,null,null,null,null,"VALORES ATUALIZADOS PARA PAGAMENTO"]
[null,null,"Nº","Registro","Autuada em","data do pgto","Ação","Autuada em","Tipo de causa","Trânsito","Entidade devedora","Órgão de origem","Origem do crédito","Origem do crédito",null,"Tributário","EC 94 2016","Lei 13.463 2017","PRC/RPV de origem","Nº DA GRU","DOENÇA GRAVE","Deficiência física","Isento de IR","Beneficiários",null,null,null,null,null,"PSSS",null,null,"R R A",null,null,"Beneficiários",null,null,null,null,null,"P S S S",null,null,"R R A"]
[null,null,null,null,null,null,null,null,null,null,null,null,null,null,null,null,null,null,null,null,null,null,null,"Total","Adv I","Adv II","Adv III","Adv IV","Requerente","Base","Desc","Patronal","NMA","Exercícios anteriores","Desconto","Total","Adv I","Adv II","Adv III","Adv IV","Reqte","BASE desc","Desc","Patronal","Exercícios anteriores","Dedução"]
[]
[null,{"$f":"IF(C11=\"\",\"\",1)","v":""}]
[null,{"$f":"IF(C12=\"\",\"\",B11+1)","v":""}]
[null,{"$f":"IF(C13=\"\",\"\",B12+1)","v":""}]
[null,""]
[null,""]
[null,""]
[null,""]
[null,""]
[null,""]
[null,""]
[null,""]
[null,""]
[null,""]
[null,""]
[null,""]
[null,""]
[null,""]
[null,""]
[null,""]
[null,""]
[null,""]
[null,""]
[null,""]
[null,""]
[null,""]
[null,""]
[null,""]
[null,""]
[null,""]
[null,""]
[null,""]
[null,""]
[null,""]
[null,""]
[null,""]
[null,""]
[null,""]
[null,""]
[null,""]
[null,""]
[null,""]
[null,""]
[null,""]
[null,""]
[null,""]
[null,""]
[null,""]
[null,""]
[null,""]
[null,""]
[null,""]
[null,""]
[null,""]
[null,""]
[null,""]
[null,""]
[null,""]
[null,""]
[null,""]
[null,""]
[null,""]
[null,""]
[null,""]
[null,""]
[null,""]
[null,""]
[null,{"$f":"IF(C77=\"\",\"\",B76+1)","v":""}]
[null,""]
[null,""]
[null,""]
[null,""]
[null,""]
[null,""]
[null,""]
[null,""]
[null,""]
[null,""]
[null,""]
[null,""]
[null,""]
[null,""]
[null,""]
[null,""]
[null,""]
[null,""]
[null,""]
[null,""]
[null,""]
[null,""]
[null,""]
[null,""]
[null,""]
[null,""]
[null,""]
[null,""]
[null,""]
[null,""]
[null,""]
[null,""]
[null,""]
[null,""]
[null,""]
[null,""]
[null,""]
[null,""]
[null,""]
[null,""]
[null,""]
[null,""]
[null,""]
[null,""]
[null,""]
[null,""]
[null,""]
[null,""]
[null,""]
[null,""]
[null,""]
[null,""]
[null,""]
[null,""]
[null,""]
[null,""]
[null,""]
[null,""]
[null,""]
[null,""]
[null,""]
[null,""]
[null,""]
[null,{"$f":"IF(C141=\"\",\"\",B140+1)","v":""}]
[null,""]
[null,""]
[null,""]
[null,""]
[null,""]
[null,""]
[null,""]
[null,""]
[null,""]
[null,""]
[null,""]
[null,""]
[null,""]
[null,""]
[null,""]
[null,""]
[null,""]
[null,""]
[null,""]
[null,""]
[null,""]
[null,""]
[null,""]
[null,""]
[null,""]
[null,""]
[null,""]
[null,""]
[null,""]
[null,""]
[null,""]
[null,""]
[null,""]
[null,""]
[null,""]
[null,""]
[null,""]
[null,""]
[null,""]
[null,""]
[null,""]
[null,""]
[null,""]
[null,""]
[null,""]
[null,""]
[null,""]
[null,""]
[null,""]
[null,""]
[null,""]
[null,""]
[null,""]
[null,""]
[null,""]
[null,""]
[null,""]
[null,""]
[null,""]
[null,""]
[null,""]
[null,""]
[null,""]
[null,{"$f":"IF(C205=\"\",\"\",B204+1)","v":""}]
[null,""]
[null,""]
[null,""]
[null,""]
[null,""]
[null,""]
[null,""]
[null,""]
[null,""]
[null,""]
[null,""]
[null,""]
[null,""]
[null,""]
[null,""]
[null,""]
[null,""]
[null,""]
[null,""]
[null,""]
[null,""]
[null,""]
[null,""]
[null,""]
[null,""]
[null,""]
[null,""]
[null,""]
[null,""]
[null,""]
[null,""]
[null,""]
[null,""]
[null,""]
[null,""]
[null,""]
[null,""]
[null,""]
[null,""]
[null,""]
[null,""]
[null,""]
[null,""]
[null,""]
[null,""]
[null,""]
[null,""]
[null,""]
[null,""]
[null,""]
[null,""]
[null,""]
[null,""]
[null,""]
[null,""]
[null,""]
[null,""]
[null,""]
[null,""]
[null,""]
[null,""]
[null,""]
[null,""]
[null,{"$f":"IF(C269=\"\",\"\",B268+1)","v":""}]
[null,""]
[null,""]
[null,""]
[null,""]
[null,""]
[null,""]
[null,""]
[null,""]
[null,""]
[null,""]
[null,""]
[null,""]
[null,""]
[null,""]
[null,""]
[null,""]
[null,""]
[null,""]
[null,""]
[null,""]
[null,""]
[null,""]
[null,""]
[null,""]
[null,""]
[null,""]
[null,""]
[null,""]
[null,""]
[null,""]
[null,""]
[null,""]
[null,""]
[null,""]
[null,""]
[null,""]
[null,""]
[null,""]
[null,""]
[null,""]
[null,""]
[null,""]
[null,""]
[null,""]
[null,""]
[null,""]
[null,""]
[null,""]
[null,""]
[null,""]
[null,""]
[null,""]
[null,""]
[null,""]
[null,""]
[null,""]
[null,""]
[null,""]
[null,""]
[null,""]
[null,""]
[null,""]
[null,""]
[null,{"$f":"IF(C333=\"\",\"\",B332+1)","v":""}]
[null,""]
[null,""]
[null,""]
[null,""]
[null,""]
[null,""]
[null,""]
[null,""]
[null,""]
[null,""]
[null,""]
[null,""]
[null,""]
[null,""]
[null,""]
[null,""]
[null,""]
[null,""]
[null,""]
[null,""]
[null,""]
[null,""]
[null,""]
[null,""]
[null,""]
[null,""]
[null,""]
[null,""]
[null,""]
[null,""]
[null,""]
[null,""]
[null,""]
[null,""]
[null,""]
[null,""]
[null,""]
[null,""]
[null,""]
[null,""]
[null,""]
[null,""]
[null,""]
[null,""]
[null,""]
[null,""]
[null,""]
[null,""]
[null,""]
[null,""]
[null,""]
[null,""]
[null,""]
[null,""]
[null,""]
[null,""]
[null,""]
[null,""]
[null,""]
[null,""]
[null,""]
[null,""]
[null,""]
[null,{"$f":"IF(C397=\"\",\"\",B396+1)","v":""}]
[null,""]
[null,""]
[null,""]
[null,""]
[null,""]
[null,""]
[null,""]
[null,""]
[null,""]
[null,""]
[null,""]
[null,""]
[null,""]
[null,""]
[null,""]
[null,""]
[null,""]
[null,""]
[null,""]
[null,""]
[null,""]
[null,""]
[null,""]
[null,""]
[null,""]
[null,""]
[null,""]
[null,""]
[null,""]
[null,""]
[null,""]
[null,""]
[null,""]
[null,""]
[null,""]
[null,""]
[null,""]
[null,""]
[null,""]
[null,""]
[null,""]
[null,""]
[null,""]
[null,""]
[null,""]
[null,""]
[null,""]
[null,""]
[null,""]
[null,""]
[null,""]
[null,""]
[null,""]
[null,""]
[null,""]
[null,""]
[null,""]
[null,""]
[null,""]
[null,""]
[null,""]
[null,""]
[null,""]
[null,{"$f":"IF(C461=\"\",\"\",B460+1)","v":""}]
[null,""]
[null,""]
[null,""]
[null,""]
[null,""]
[null,""]
[null,""]
[null,""]
[null,""]
[null,""]
[null,""]
[null,""]
[null,""]
[null,""]
[null,""]
[null,""]
[null,""]
[null,""]
[null,""]
[null,""]
[null,""]
[null,""]
[null,""]
[null,""]
[null,""]
[null,""]
[null,""]
[null,""]
[null,""]
[null,""]
[null,""]
[null,""]
[null,""]
[null,""]
[null,""]
[null,""]
[null,""]
[null,""]
[null,""]
[null,""]
[null,""]
[null,""]
[null,""]
[null,""]
[null,""]
[null,""]
[null,""]
[null,""]
[null,""]
[]
[null,null,null,null,null,null,null,null,null,null,null,null,null,null,null,null,null,null,null,null,null,null,null,null,null,null,null,null,null,null,null,null,null,null,"Totais pagas",{"$f":"SUM(AJ11:AJ510)","v":0},{"$f":"SUM(AK11:AK510)","v":0},0,0,0,{"$f":"SUM(AO11:AO510)","v":0}]